program: Gaussian 09
title: 000296861
version: EM64L-G09RevD.01
frameworkgroup: C1[X(C12H7BrO)]
method: RPBEPBE
basis: SDD
operation: Freq
keyword: #p
keyword: freq=noraman
keyword: PBEPBE/SDD
title: #p freq=noraman PBEPBE/SDD
converged: NO NO NO YES
title: Mulliken charges:
elementType: Br O C C C C C C C C C C C C H H H H H H H
charge: 0.016746 -0.260928 0.205285 0.205065 0.187319 0.174489 -0.376786 -0.385813 -0.301036 -0.351013 -0.190890 -0.236623 -0.208385 -0.214636 0.248193 0.241699 0.278067 0.258046 0.249687 0.228855 0.232657
chargesum: 0.00000
title: Mulliken charges with hydrogens summed into heavy atoms:
elementType: Br O C C C C C C C C C C C C
charge: 0.016746 -0.260928 0.205285 0.205065 0.187319 0.174489 -0.128593 -0.144114 -0.022970 -0.092968 0.058797 -0.007768 -0.208385 0.018022
polarizability: 2.74982785e+02 -1.33358763e+00 1.34575456e+02 2.63547893e-03 1.68984119e-03 5.32090951e+01
1716.lowfreq: -2.6582 -1.2530 -0.0006 -0.0003 0.0006 15.1935 58.4588 132.4638 141.0534
frequency: 58.4372 132.4623 141.0533 182.8651 213.5225 291.8605 305.4230 327.5363 429.6862 444.4412 462.6121 518.9919 553.7456 561.3906 589.1357 628.1288 669.9208 720.2223 735.7913 752.9075 767.3995 820.0883 822.5230 847.3400 863.6644 869.6914 943.6726 953.5283 981.8089 987.3889 1013.5355 1044.2228 1093.7055 1122.7270 1158.1133 1172.1257 1180.1641 1226.5282 1265.9891 1306.6438 1375.4251 1391.8250 1422.0493 1436.6783 1441.9304 1474.4301 1579.6650 1597.6154 1604.5659 1638.7531 3135.1182 3146.6885 3149.2454 3163.8817 3176.5599 3178.3448 3185.4585
redmass: 8.0555 7.7217 4.0722 5.4866 12.0596 5.8979 5.9846 5.6511 3.0181 3.0948 7.0092 4.9268 8.5544 4.1358 4.2811 7.3174 8.0979 4.0679 5.6994 1.9997 1.7491 7.1298 1.5020 7.7406 1.4313 1.4163 1.3886 1.3519 1.3119 6.8162 2.0792 1.8846 2.2345 1.9143 1.5424 1.8838 1.7920 1.7445 1.5308 1.8652 3.5558 5.7672 4.7363 2.6298 2.9095 3.4009 8.3825 7.6423 7.4956 8.3784 1.0860 1.0909 1.0897 1.0962 1.0959 1.0986 1.0939
irintensity: 0.4177 0.1362 0.8358 0.4127 0.9722 4.2773 0.1040 0.2664 14.2657 1.4974 7.2109 0.0516 0.5451 0.1227 7.4659 0.0235 4.0519 9.1117 7.0733 36.3046 77.6152 6.4228 30.4224 115.7845 1.2424 24.9682 3.1604 0.3314 0.0169 4.9369 10.2720 25.3543 18.5845 15.6727 29.0934 15.7903 25.1779 16.4920 1.5882 6.9439 19.2186 22.4904 16.1053 75.1964 40.4344 19.0454 2.3561 47.1708 18.9840 5.6452 0.7494 8.5473 4.5298 22.4926 5.9865 12.3650 0.2730
temp: 298.150 k
press: 1.00000 atm
elementType: 35 8 6 6 6 6 6 6 6 6 6 6 6 6 1 1 1 1 1 1 1
symmnumber: 1
zpe: 396318.2 jmol-1
zpe.correction: 0.150950 hartree
zpe.thermalcorrener: 0.161262 hartree
zpe.thermalcorrenthalpy: 0.162206 hartree
zpe.thermalcorrgfe: 0.113771 hartree
zpe.sumelectzpe: -549.224306 hartree
zpe.sumelectthermal: -549.213994 hartree
zpe.sumelectthermalent: -549.213050 hartree
zpe.sumelectthermalfe: -549.261485 hartree
dipole: 2.4236 1.4397 0.0000
dipole: 2.8189
quadrupole: -80.5999 -80.1958 -95.1739
quadrupole: 0.4834 0.0002 0.0003
quadrupole: 4.7233 5.1274 -9.8507 0.4834 0.0002 0.0003
hfenergy: -549.3752557 hartree
pointgroup: C01 [X(C12H7Br1O1)]
dipole: 0.9275492 0.6079808 0.000018 debye
dipolederiv: -0.8224209 -0.1168257 -0.0000097 -0.1722131 -0.0881438 -0.0000028 -0.000009 -0.000002 -0.0315489 -1.2943529 0.020176 -0.0000122 0.0494709 -0.4709997 -0.0000061 -0.0000192 -0.0000054 -0.1515707 0.1513956 -0.1695745 -0.0000035 0.2626532 -0.1597926 -0.0000009 0.0000009 -0.0000087 0.0082406 0.1507181 0.144885 0.0000032 -0.2452651 -0.1350087 -0.0000059 -0.0000036 0. 0.000671 0.6380274 -0.2179842 0.0000037 -0.6311175 0.3152479 -0.000004 -0.000002 -0.0000005 0.0796444 0.6247922 0.1990932 0.0000108 0.6367211 0.2071815 0.0000116 0.0000232 0.0000082 0.0656194 0.2073502 0.0732245 0.000008 -0.1468106 0.0929338 0.0000063 0.000004 0.0000071 -0.1392612 0.0949393 -0.0627886 0.0000013 0.0706506 0.1051239 0.000004 0.0000048 0.0000027 -0.1463989 -0.451586 0.1084238 0.0000011 0.0000404 -0.0347352 0.000007 0.0000047 0.0000133 -0.1103422 -0.07608 -0.115051 -0.0000019 -0.0948524 0.0499515 0.0000005 0.0000015 -0.0000032 -0.1650358 -0.5362624 -0.2042754 -0.0000065 -0.2348778 -0.0849152 -0.0000028 -0.0000068 -0.0000032 -0.1126572 -0.1068705 0.1226381 0.0000034 0.2238033 -0.0382898 0.0000055 0.0000071 0.000005 -0.1675701 1.3140615 0.1949269 0.0000151 0.4117501 0.2186118 0.0000116 0.0000134 0.0000085 -0.1437981 -0.0475692 0.0025009 0. -0.1288995 0.0807102 0.0000039 -0.0000022 0.0000056 -0.1658013 0.042855 -0.0738286 -0.000004 -0.0354853 -0.0517728 -0.0000063 -0.000004 -0.0000054 0.1590712 0.0828943 0.0616402 0.0000003 0.0123679 -0.0754797 -0.0000037 -0.0000003 -0.0000038 0.1578263 0.0991998 -0.0191338 -0.0000022 -0.0415588 0.0158031 -0.0000074 -0.0000038 -0.0000092 0.1838893 0.0928089 0.0090359 -0.0000006 0.0467096 -0.0430519 -0.0000022 -0.0000014 -0.0000015 0.1826951 0.0073274 0.0795814 -0.000001 0.0770623 0.0235125 -0.0000021 0.0000004 -0.0000019 0.1674488 -0.0585566 -0.0976884 -0.0000046 -0.1151568 -0.0002009 -0.0000047 -0.0000049 -0.0000046 0.1656263 -0.112671 0.0610242 -0.000001 0.0550077 0.0733142 -0.0000015 -0.0000026 -0.0000009 0.1632519 unknown
polarizability: 274.8265445|4.8673721|134.7316965|0.0025583|0.0018046|53.2090951 unknown
InChI: InChI=1S/C12H7BrO/c13-8-5-6-10-9-3-1-2-4-11(9)14-12(10)7-8/h1-7H
charge 0 multiplicity 1
21 atoms
Br -4.976906 -0.450881 -0.000072
O  0.29057 -1.665748 -0.000035
C  -0.32312 0.601001 0.000012
C  1.136277 0.527794 0.000022
C  -0.787065 -0.749168 -0.000035
C  1.462826 -0.861725 -0.000001
C  -1.276849 1.643632 0.000023
C  2.18663 1.474541 0.000045
C  -2.139442 -1.112121 -0.000061
C  2.772634 -1.354495 -0.000002
C  -2.65202 1.318527 -0.000013
C  3.519122 1.004155 0.000052
C  -3.058562 -0.040167 -0.00005
C  3.80783 -0.388503 0.000024
H  -0.968852 2.694062 0.000056
H  1.97743 2.549635 0.00006
H  -2.455759 -2.157427 -0.000109
H  2.979624 -2.42797 -0.000012
H  -3.404242 2.111955 -0.00001
H  4.345733 1.722494 0.000078
H  4.85074 -0.723094 0.000025
