program: Gaussian 09
title: 000296853
version: EM64L-G09RevD.01
frameworkgroup: C1[X(C10H14O5)]
method: RPBEPBE
basis: SDD
operation: Freq
keyword: #pfreq=noraman
keyword: PBEPBE/SDD
title: #p freq=noraman PBEPBE/SDD
converged: YES YES NO NO
title: Mulliken charges:
elementType: O O O O O C C C C C C C C C C H H H H H H H H H H H H H H
charge: -0.170075 -0.260871 -0.264155 -0.216978 -0.211048 0.037857 -0.477103 -0.408965 -0.396734 -0.523080 0.153301 0.192136 0.220052 -0.501298 -0.498514 0.245981 0.246899 0.211700 0.217726 0.219847 0.211901 0.270415 0.240779 0.235574 0.241001 0.254685 0.242532 0.254191 0.232244
chargesum: 0.00000
title: Mulliken charges with hydrogens summed into heavy atoms:
elementType: O O O O O C C C C C C C C C C
charge: -0.170075 -0.260871 -0.264155 -0.216978 -0.211048 0.037857 0.015777 0.020462 0.035014 -0.011887 0.153301 0.192136 0.220052 0.229962 0.230454
polarizability: 1.25918683e+02 -4.94266964e-01 1.21565520e+02 -3.68978003e-01 1.15209376e+00 1.05314919e+02
1716.lowfreq: -14.4459 -8.4737 -5.9554 -0.0005 0.0008 0.0009 38.6952 56.1943 76.6629
frequency: 38.6467 56.1366 76.6595 83.7151 89.9176 108.5588 110.8916 130.2504 139.2835 183.5032 209.5152 239.9356 257.8424 277.5332 298.5370 325.1542 362.3628 378.5721 403.2810 474.6452 485.4292 532.1887 631.5621 666.3255 673.9738 722.7077 745.7869 794.0092 838.0076 858.0670 866.7367 908.3621 927.1044 953.6211 984.8513 1028.3611 1054.0453 1082.7434 1101.3357 1111.5907 1113.3948 1118.1106 1125.9840 1150.5408 1151.5569 1175.0318 1198.6929 1220.3570 1254.1730 1271.9237 1304.5045 1330.9113 1340.1987 1347.8580 1420.1709 1421.2431 1450.9667 1451.9941 1453.7975 1462.2108 1462.3586 1465.1840 1471.2874 1476.1515 1626.1433 1631.2441 1644.2634 2979.3512 2986.6284 3000.5674 3008.5651 3008.8627 3016.4911 3042.4049 3052.4263 3082.4808 3084.6986 3114.0864 3114.1476 3153.0057 3154.6421
redmass: 5.8019 5.3011 2.7907 4.1780 1.4547 1.3061 2.0650 3.8858 3.2233 3.7098 5.4899 3.0859 4.4003 4.0903 4.1957 2.6222 6.5581 4.2260 4.1732 2.2316 4.5738 4.3381 6.0604 6.8016 3.2259 4.5424 5.6748 2.0566 3.3662 3.2979 2.6399 1.5465 5.0220 2.6730 3.2639 4.4937 2.4226 2.1122 2.4809 1.4758 1.2736 1.8864 1.9775 1.4570 1.4593 4.6870 2.8326 1.8153 1.3563 1.4076 1.3461 1.3897 1.4049 1.4669 1.1809 1.1792 1.0862 1.0496 1.0497 1.0508 1.0535 1.0809 1.0801 1.0908 10.7913 10.2285 10.7927 1.0636 1.0624 1.0617 1.0291 1.0292 1.0628 1.0947 1.1015 1.1006 1.1039 1.1049 1.1049 1.1053 1.1052
irintensity: 1.4755 1.9448 2.8709 4.2368 0.5248 0.3313 0.4411 0.9488 1.8180 3.3853 0.4660 6.6132 8.5358 10.0695 7.5124 5.0597 3.5855 3.2660 4.5380 1.7921 3.0866 21.6830 3.4256 13.0942 1.2196 8.0835 11.3867 3.7024 3.1310 3.1389 14.7719 6.9786 4.8326 9.4884 37.6820 29.4949 20.5568 56.8201 16.2642 36.5125 0.9657 101.2784 119.6193 18.3680 4.8083 147.3921 154.4861 39.2983 14.8514 36.8982 12.4581 0.9699 1.1625 0.5669 20.5232 12.6822 27.3685 12.3653 13.9979 11.3345 5.6529 18.2967 17.9669 7.6745 142.0385 135.2319 207.2872 27.7713 35.6473 5.4485 39.8101 21.6172 6.6682 44.1680 43.9764 10.9340 19.1090 20.1325 18.5343 14.1674 12.9620
temp: 298.150 k
press: 1.00000 atm
elementType: 8 8 8 8 8 6 6 6 6 6 6 6 6 6 6 1 1 1 1 1 1 1 1 1 1 1 1 1 1
symmnumber: 1
zpe: 601424.7 jmol-1
zpe.correction: 0.229071 hartree
zpe.thermalcorrener: 0.245175 hartree
zpe.thermalcorrenthalpy: 0.246120 hartree
zpe.thermalcorrgfe: 0.185001 hartree
zpe.sumelectzpe: -764.413250 hartree
zpe.sumelectthermal: -764.397145 hartree
zpe.sumelectthermalent: -764.396201 hartree
zpe.sumelectthermalfe: -764.457319 hartree
dipole: -1.3375 0.2761 4.4664
dipole: 4.6706
quadrupole: -76.7389 -80.4497 -94.9185
quadrupole: -1.5154 2.1077 -0.1996
quadrupole: 7.2968 3.5860 -10.8828 -1.5154 2.1077 -0.1996
hfenergy: -764.6423203 hartree
pointgroup: C01 [X(C10H14O5)]
dipole: 0.4871343 -0.1598505 1.7645743 debye
polarizability: 125.7867083|-0.8472098|121.6918162|0.5858258|-1.1388111|105.3205976 unknown
InChI: InChI=1S/C10H14O5/c1-14-8(12)10(9(13)15-2)6-4-3-5-7(10)11/h3-6H2,1-2H3
charge 0 multiplicity 1
29 atoms
O  -0.493783 1.785121 -1.64828
O  0.415391 -2.205979 0.585555
O  -2.275643 0.762855 0.701863
O  1.423735 -1.351272 -1.326033
O  -2.070951 -1.033638 -0.76089
C  -0.035288 0.1027 0.090869
C  0.385365 0.52157 1.54324
C  1.880398 0.900288 1.616876
C  2.211695 2.064669 0.65684
C  1.801182 1.73029 -0.806509
C  0.357284 1.261496 -0.890763
C  0.688979 -1.196667 -0.326989
C  -1.54884 -0.154129 -0.044996
C  0.942821 -3.54975 0.23973
C  -3.746834 0.710702 0.512829
H  0.152446 -0.311704 2.228235
H  -0.238402 1.383731 1.839604
H  2.510429 0.021095 1.372744
H  2.127595 1.186966 2.656532
H  3.292621 2.29601 0.683704
H  1.675841 2.976789 0.986274
H  2.441038 0.912628 -1.191091
H  1.918409 2.6034 -1.470674
H  0.653736 -4.189028 1.084999
H  2.038351 -3.51207 0.119453
H  0.480839 -3.896757 -0.699037
H  -4.131345 -0.284824 0.790437
H  -3.991362 0.918656 -0.541738
H  -4.142005 1.492349 1.176114
