program: Gaussian 09
title: 000296906
version: EM64L-G09RevD.01
frameworkgroup: C1[X(C20H21NO2)]
method: RPBEPBE
basis: SDD
operation: Freq
keyword: #p
keyword: freq=noraman
keyword: PBEPBE/SDD
title: #p freq=noraman PBEPBE/SDD
converged: YES YES NO NO
title: Mulliken charges:
elementType: O O N C C C C C C C C C C C C C C C C C C C C H H H H H H H H H H H H H H H H H H H H H
charge: -0.323486 -0.273229 -0.467194 0.386891 -0.278187 -0.187399 -0.542588 -0.547184 -0.216556 -0.257492 -0.412956 -0.772020 0.261611 0.337942 0.158391 -0.384897 0.433630 -0.338130 -0.232758 -0.470828 -0.424747 -0.273563 -0.243318 0.251006 0.235881 0.230571 0.220694 0.251435 0.213850 0.277825 0.239775 0.267184 0.225674 0.210319 0.234420 0.219987 0.332224 0.299209 0.192912 0.238522 0.227663 0.239502 0.228931 0.230482
chargesum: 0.00000
title: Mulliken charges with hydrogens summed into heavy atoms:
elementType: O O N C C C C C C C C C C C C C C C C C C C C
charge: -0.323486 -0.273229 -0.134970 0.386891 -0.027181 0.048482 -0.091323 -0.081899 0.061269 -0.017717 0.079902 -0.107294 0.261611 0.337942 0.158391 -0.085688 0.433630 -0.145218 -0.005095 -0.232305 -0.185245 -0.044632 -0.012836
polarizability: 3.20861501e+02 -1.29583757e+01 2.44594952e+02 2.66860537e+01 -2.11888081e-01 1.32573620e+02
1716.lowfreq: -16.7679 -2.2685 -1.9099 -0.0005 -0.0002 0.0004 12.2891 23.7250 36.9490
frequency: 7.6419 23.2800 36.8327 60.9527 67.6117 98.4109 129.7843 150.6396 177.6088 181.8744 208.3077 221.9096 255.3886 272.2446 283.5278 312.0207 358.1412 380.6603 414.9577 418.0359 420.2897 430.1878 472.0099 477.3382 508.4113 514.0479 540.1390 558.2107 613.6453 621.5636 628.7237 645.9759 667.8502 696.0091 697.9615 735.2210 740.5621 749.6792 769.5751 782.2469 783.4303 808.1577 819.7857 837.8103 859.8530 869.4828 870.1790 897.8058 902.5102 915.8526 924.3053 927.8531 932.9500 949.7732 952.0301 957.3045 969.8044 978.4798 983.4402 985.5864 992.6245 1025.8467 1033.0418 1059.8508 1072.4528 1092.6160 1094.8215 1117.5323 1122.2017 1133.8448 1150.5276 1160.6468 1180.6652 1182.4598 1195.8355 1213.6932 1231.8596 1235.7734 1248.4525 1260.9058 1272.0187 1273.3182 1280.4449 1289.1390 1295.7571 1323.8744 1345.2030 1367.8958 1385.9380 1408.9758 1420.0843 1443.8735 1453.4096 1455.0268 1463.8068 1472.9475 1476.6302 1485.8816 1494.2118 1540.7825 1583.3315 1591.7846 1598.7574 1635.0254 1662.9009 2976.9652 2993.9773 3012.8709 3018.7627 3053.3470 3066.5224 3073.0266 3080.9650 3085.9052 3087.8388 3093.3121 3111.3361 3125.4805 3130.2490 3143.1564 3154.2648 3159.3466 3163.7925 3190.8214 3196.7139 3564.7120
redmass: 4.3622 5.3127 4.4820 6.4668 5.2343 5.0604 3.9231 3.9018 4.0806 2.9936 2.0691 1.7835 3.8698 3.9813 4.5038 3.3951 2.5339 2.2983 2.8820 3.0125 3.8616 3.7512 3.3748 1.8102 6.4078 5.8062 3.1442 2.4058 3.4774 4.8701 1.7024 3.4273 5.8146 3.1847 5.4556 1.8050 1.2898 5.6952 4.1261 5.4389 2.0736 1.4247 3.6854 2.1837 4.6844 2.1881 2.0680 3.2231 2.8565 2.0309 1.3541 1.8847 1.7957 2.1448 1.4017 1.8080 2.1042 3.5007 1.6727 1.3309 1.3575 1.4968 2.7846 2.6521 1.1975 1.2189 2.2422 1.2844 1.7835 1.9009 1.7344 1.8741 2.0199 1.1161 1.2906 1.5719 1.7651 1.8969 1.5796 1.3310 1.5897 1.3748 1.9361 2.3604 1.5706 1.7169 1.2874 2.2177 1.2047 2.8674 5.4309 2.4891 1.2176 1.8866 1.0823 1.0809 1.0639 1.0919 2.4631 2.7820 5.6715 7.3795 5.2774 6.2861 7.1386 1.0369 1.0594 1.0577 1.0599 1.1050 1.0972 1.0887 1.0925 1.1010 1.1070 1.1038 1.0865 1.0875 1.0868 1.0939 1.0967 1.0892 1.1003 1.0943 1.1077 1.0748
irintensity: 0.0332 0.3086 0.7327 2.4739 1.1530 1.9046 0.0559 1.2390 2.7463 2.2965 1.0559 0.5616 0.9471 4.7470 13.1036 3.1998 6.0128 2.0309 4.5097 10.8881 10.4473 6.9593 0.1019 2.8943 0.3101 0.2456 1.1093 0.0392 12.8150 14.0258 19.1958 4.3238 8.1305 5.0249 51.6904 43.5774 24.8301 1.5737 7.5889 4.2369 69.3771 74.0523 5.5081 5.5373 17.9561 9.8710 10.6635 3.6461 2.5961 10.3062 2.3151 2.6341 12.9087 6.7367 1.9139 32.3644 1.2912 217.5333 25.0409 1.2466 4.4957 4.1980 61.0312 134.5873 1.7711 2.6184 29.4832 3.4117 3.7231 3.7751 209.0328 215.4757 18.8080 8.0453 2.3557 4.0057 2.6993 3.4462 6.3216 1.4654 15.2398 5.9576 1.8843 21.5417 5.5082 24.7144 5.9911 56.8752 21.7699 33.7352 97.8746 3.1187 6.3155 3.5632 11.9766 1.9590 4.1993 53.2766 382.9379 443.2987 1.4522 51.2762 10.4262 10.7736 235.7111 26.9585 33.0570 47.9008 38.9640 25.0467 27.0899 75.3165 20.7825 40.1541 15.6451 33.3442 18.2940 0.8609 1.9238 31.6150 32.4022 8.9189 28.5948 4.2410 8.4330 28.0100
temp: 298.150 k
press: 1.00000 atm
elementType: 8 8 7 6 6 6 6 6 6 6 6 6 6 6 6 6 6 6 6 6 6 6 6 1 1 1 1 1 1 1 1 1 1 1 1 1 1 1 1 1 1 1 1 1
symmnumber: 1
zpe: 949631.0 jmol-1
zpe.correction: 0.361695 hartree
zpe.thermalcorrener: 0.381160 hartree
zpe.thermalcorrenthalpy: 0.382104 hartree
zpe.thermalcorrgfe: 0.311484 hartree
zpe.sumelectzpe: -978.269274 hartree
zpe.sumelectthermal: -978.249810 hartree
zpe.sumelectthermalent: -978.248866 hartree
zpe.sumelectthermalfe: -978.319486 hartree
dipole: -0.0637 -2.4524 0.0999
dipole: 2.4553
quadrupole: -115.8752 -128.9329 -140.2853
quadrupole: 2.2731 5.5047 0.9971
quadrupole: 12.4893 -0.5684 -11.9208 2.2731 5.5047 0.9971
hfenergy: -978.6309697 hartree
pointgroup: C01 [X(C20H21N1O2)]
dipole: 0.053577 -0.7624683 0.5906817 debye
polarizability: 317.2568693|34.0483597|201.6301066|17.2868625|-53.8500455|179.1430973 unknown
InChI: InChI=1S/C20H21NO2/c1-20(12-14-9-10-16(20)11-14)13-23-19(22)21-18-8-4-6-15-5-2-3-7-17(15)18/h2-10,14,16,21H,11-13H2,1H3
charge 0 multiplicity 1
44 atoms
O  1.244242 0.084384 1.361086
O  0.682106 1.759848 -0.210869
N  -0.857699 0.126696 0.565545
C  3.64588 -0.415178 0.845409
C  3.55856 -0.498013 -0.749016
C  5.6896 0.235974 -0.421699
C  5.122091 0.119642 1.048845
C  5.001306 -0.995193 -1.089381
C  3.63726 0.935338 -1.295271
C  4.914578 1.374776 -1.097851
C  2.647001 0.586619 1.461815
C  3.437418 -1.807585 1.493526
C  0.372558 0.762868 0.488074
C  -2.055613 0.444814 -0.126882
C  -3.23068 -0.360987 0.15116
C  -2.119057 1.496437 -1.055228
C  -4.458018 -0.052999 -0.55808
C  -3.247732 -1.445922 1.091712
C  -3.33836 1.778899 -1.737109
C  -4.487712 1.025101 -1.501865
C  -5.630941 -0.837656 -0.299539
C  -4.406998 -2.191627 1.3226
C  -5.613324 -1.886895 0.619825
H  2.71614 -1.108884 -1.108644
H  6.78784 0.292423 -0.475347
H  5.715274 -0.600374 1.64239
H  5.15442 1.093686 1.571379
H  5.182366 -1.044022 -2.176082
H  5.27162 -1.959865 -0.62492
H  2.778239 1.509226 -1.649285
H  5.30887 2.378276 -1.281066
H  2.704023 1.573389 0.970852
H  2.824403 0.690285 2.547296
H  3.582028 -1.755237 2.589821
H  2.413073 -2.174968 1.306479
H  4.150447 -2.551375 1.097971
H  -0.872209 -0.659503 1.2156
H  -1.226949 2.09526 -1.246849
H  -2.350605 -1.719163 1.660622
H  -5.422671 1.244754 -2.029377
H  -3.357947 2.605102 -2.455925
H  -6.550959 -0.592907 -0.843663
H  -4.391965 -3.013346 2.046668
H  -6.516805 -2.476903 0.807174
