program: Gaussian 09
title: 000296845
version: EM64L-G09RevD.01
frameworkgroup: C1[X(C8H10O2)]
method: RPBEPBE
basis: SDD
operation: Freq
keyword: #pfreq=noraman
keyword: PBEPBE/SDD
title: #p freq=noraman PBEPBE/SDD
converged: YES YES NO NO
title: Mulliken charges:
elementType: O O C C C C C C C C H H H H H H H H H H
charge: -0.425784 -0.231980 -0.265754 -0.233380 -0.207216 -0.245371 -0.166392 -0.456494 -0.477196 0.142848 0.265264 0.254615 0.255238 0.260183 0.263215 0.216608 0.218769 0.209995 0.250575 0.372259
chargesum: 0.00000
title: Mulliken charges with hydrogens summed into heavy atoms:
elementType: O O C C C C C C C C
charge: -0.053524 -0.231980 -0.000490 0.021235 0.048022 0.014812 0.096822 -0.021117 -0.016626 0.142848
polarizability: 9.44357205e+01 4.40930648e-01 7.99171217e+01 1.51903250e-01 1.56102293e+00 6.98559875e+01
1716.lowfreq: -18.0865 -6.7659 -0.0002 0.0005 0.0006 12.1982 31.6654 142.6413 175.8620
frequency: 31.2627 142.6188 175.8566 343.1230 361.6599 427.6838 434.6601 589.9072 601.7531 645.6787 681.7978 713.1793 792.1106 796.9855 801.5242 869.1541 897.4956 900.9219 906.8206 928.1683 937.6867 973.0728 980.2403 1008.3560 1028.2095 1042.3584 1048.6717 1066.5033 1079.6844 1117.2852 1127.9166 1166.4925 1208.3507 1232.8767 1241.1917 1253.7155 1261.0691 1287.7763 1299.3252 1346.7906 1364.2357 1461.4535 1478.8589 1656.9667 3003.3745 3016.4545 3046.6470 3066.5519 3085.8255 3107.2848 3174.5373 3178.2217 3198.7401 3503.9461
redmass: 6.8613 4.7329 4.1871 4.7319 6.4441 1.8579 1.9333 2.4187 2.1843 3.3918 3.0950 4.1463 2.1067 2.8533 1.9386 3.1010 2.4742 2.4786 1.9761 2.1878 2.1938 4.0137 1.4341 1.3975 1.7987 1.5458 1.4766 1.2365 1.7209 1.2980 1.3110 1.6599 1.6703 1.5050 1.5790 1.5163 1.6688 1.7291 1.7272 2.5908 1.9463 1.0938 1.1010 8.0220 1.0592 1.0615 1.0852 1.1050 1.1036 1.0914 1.0919 1.0918 1.1014 1.0638
irintensity: 1.2535 1.4137 0.0696 4.5347 6.4009 0.8944 2.5743 52.9734 55.9146 17.4380 31.1336 37.3462 11.5451 11.2093 19.6648 1.2476 3.5035 6.7820 4.4241 4.1609 0.8035 71.2932 6.4494 4.1538 6.4388 118.9885 29.1702 22.2580 97.4378 3.1854 0.5671 5.7321 5.3889 1.2983 3.4237 2.8951 3.7380 6.0809 7.9307 3.5178 56.8623 11.3661 8.0113 189.9973 46.2699 41.1078 8.8050 33.1983 19.0046 29.0316 7.0029 6.3721 20.8177 20.4481
temp: 298.150 k
press: 1.00000 atm
elementType: 8 8 6 6 6 6 6 6 6 6 1 1 1 1 1 1 1 1 1 1
symmnumber: 1
zpe: 431212.1 jmol-1
zpe.correction: 0.164240 hartree
zpe.thermalcorrener: 0.172182 hartree
zpe.thermalcorrenthalpy: 0.173127 hartree
zpe.thermalcorrgfe: 0.130765 hartree
zpe.sumelectzpe: -460.519028 hartree
zpe.sumelectthermal: -460.511086 hartree
zpe.sumelectthermalent: -460.510142 hartree
zpe.sumelectthermalfe: -460.552503 hartree
dipole: -0.8577 -1.3540 0.0342
dipole: 1.6031
quadrupole: -53.4992 -62.9569 -56.7351
quadrupole: -2.6608 0.8241 -1.4419
quadrupole: 4.2312 -5.2265 0.9953 -2.6608 0.8241 -1.4419
hfenergy: -460.6832683 hartree
pointgroup: C01 [X(C8H10O2)]
dipole: 0.3558182 0.4546877 -0.253862 debye
dipolederiv: -0.899221 0.4543974 -0.3288865 0.4624718 -0.6763918 0.1502068 -0.2530931 0.1055874 -0.4360062 -0.7009055 -0.1498372 0.1465628 0.0395824 -0.6864833 0.262702 0.0665843 0.3325562 -0.530563 -0.0959099 -0.0336369 -0.0994749 -0.068381 0.0449753 0.0040478 -0.0701501 -0.017453 -0.0103122 -0.0616607 -0.0602032 0.0694206 -0.0499261 -0.0009168 0.0359176 0.1004372 0.036677 0.0125279 0.0930592 0.0238226 -0.0105958 0.0261896 0.031003 0.0369229 -0.0128996 0.0458332 -0.1031569 0.1471662 0.0338998 0.0359636 0.0667077 0.1128406 0.0148097 0.1916941 0.0471666 0.0668869 -0.366956 -0.0901454 -0.0115212 -0.1837406 -0.0098763 -0.046369 -0.0624068 -0.033941 0.0606087 -0.0106402 0.0276177 0.0997036 0.0024723 0.0605058 -0.0336955 0.033368 -0.0447823 0.105898 0.0981696 0.0366129 0.0162843 0.0394103 -0.0315623 0.071793 -0.0034078 0.058154 0.008605 1.5520206 -0.2214992 0.0455384 -0.325513 0.9366331 -0.5308672 -0.0636946 -0.5688469 0.543517 0.0279664 -0.0180069 -0.053101 0.0021655 -0.0272321 -0.099418 -0.0524611 -0.0880748 0.0426696 -0.0394653 0.0436431 0.103601 0.0540762 0.0140525 -0.0500236 0.0963429 -0.0455682 0.0537354 0.0930063 0.0601739 -0.0028141 0.0753495 -0.0813225 0.0479569 -0.0133159 0.0402213 0.0305636 0.0295465 0.075041 0.0226836 0.0626633 -0.1016257 -0.0621077 0.0136472 -0.0572234 0.0446743 0.0343127 0.0135513 -0.015702 0.0548881 0.0225667 0.0921767 -0.0163212 0.0784168 -0.0519308 0.0832519 0.0285033 -0.0309214 -0.0199179 -0.0300488 0.1069762 0.0196045 0.1352003 -0.100021 -0.1070562 -0.0970243 -0.0703471 -0.0704583 0.0182924 -0.029563 -0.1056798 -0.0722366 0.0158197 -0.0635002 -0.0483298 -0.150393 -0.0426799 0.0464582 -0.0855121 -0.0944024 -0.0467531 -0.0415142 -0.0111951 -0.0270037 0.1372372 -0.02597 0.0601509 0.0305656 0.0947263 0.0143781 0.0056255 0.1980104 -0.0515761 0.096762 -0.09939 0.2979813 0.0834809 0.1314278 0.0806884 0.2823727 unknown
polarizability: 94.4215047|-0.5054128|76.1187122|-0.6846313|-5.1003665|73.6686127 unknown
InChI: InChI=1S/C8H10O2/c9-8(10)6-3-1-4-5(2-3)7(4)6/h3-7,9H,1-2H2
charge 0 multiplicity 1
20 atoms
O  -2.726133 0.923051 -0.500953
O  -2.100352 -0.900892 0.786555
C  0.509188 -0.921333 -0.754725
C  1.961187 -0.38936 -0.672695
C  1.32013 -1.089969 0.549367
C  0.536339 1.094521 0.419991
C  -0.404702 0.302395 -0.579143
C  1.85919 1.123721 -0.411639
C  0.861723 0.022008 1.505591
C  -1.774444 0.003356 -0.016065
H  0.225685 -1.770322 -1.377688
H  2.772375 -0.836209 -1.249221
H  1.639289 -2.072584 0.89825
H  0.150993 2.062466 0.769738
H  -0.531406 0.879114 -1.511854
H  1.766269 1.717243 -1.339435
H  2.707471 1.515657 0.178688
H  1.664644 0.362113 2.184849
H  -0.01695 -0.27565 2.101891
H  -3.610296 0.713876 -0.092101
