program: Gaussian 09
title: 000296831
version: EM64L-G09RevD.01
frameworkgroup: C1[X(C13H10O3)]
method: RPBEPBE
basis: SDD
operation: Freq
keyword: #pfreq=noraman
keyword: PBEPBE/SDD
title: #p freq=noraman PBEPBE/SDD
converged: YES YES NO NO
title: Mulliken charges:
elementType: O O O C C C C C C C C C C C C C H H H H H H H H H H
charge: -0.211961 -0.434380 -0.243741 0.182971 -0.588274 0.024940 0.303623 0.357910 -0.317659 -0.389328 -0.395507 -0.361525 0.081583 -0.235955 -0.236457 -0.234041 0.285269 0.288994 0.250460 0.275986 0.237443 0.280260 0.228763 0.230494 0.232549 0.387582
chargesum: 0.00000
title: Mulliken charges with hydrogens summed into heavy atoms:
elementType: O O O C C C C C C C C C C C C C
charge: -0.211961 -0.046798 -0.243741 0.182971 -0.014012 0.024940 0.303623 0.357910 -0.067199 -0.113341 -0.158064 -0.081265 0.081583 -0.007192 -0.005963 -0.001492
polarizability: 3.09529055e+02 -7.89718462e+00 1.46225153e+02 -2.33614533e-01 -4.72659709e+00 6.94207768e+01
1716.lowfreq: -7.7805 -3.1560 -0.0010 -0.0008 -0.0006 3.8229 29.3988 49.8938 60.4224
frequency: 29.3728 49.8866 60.4174 84.4451 96.3865 154.7563 195.0692 236.4109 279.6857 305.6560 364.3777 394.2456 404.3377 441.6068 463.3497 492.8676 524.8454 561.3783 589.0310 596.4986 614.5571 640.0462 684.6639 693.0117 694.9875 703.6260 769.3542 845.8699 880.7240 893.1626 914.8110 927.3181 946.7255 974.6917 982.9202 987.8799 996.8384 1007.4581 1030.6455 1083.7348 1095.2867 1131.4748 1159.6743 1171.0539 1175.6784 1201.5743 1280.5723 1294.7272 1313.0610 1317.7665 1349.9172 1376.8347 1385.2357 1387.1842 1436.2454 1482.9121 1547.6272 1560.7243 1576.7581 1606.3522 1618.9009 1635.9803 2978.3696 3029.2664 3124.0462 3129.5748 3134.6499 3147.2578 3154.7391 3163.5180 3195.6054 3528.6255
redmass: 5.5943 4.6717 4.6590 3.7453 5.5175 5.6608 5.7350 8.3038 3.7158 3.8985 5.1362 6.1396 3.0734 6.4599 2.5226 3.4156 7.7877 4.9251 1.5157 3.7534 5.7883 2.5583 5.6543 5.3417 1.7542 4.6535 1.8740 1.2511 3.9341 1.4560 2.8661 1.5825 5.9811 1.3954 1.5389 4.3540 1.3723 3.6904 2.2416 1.9346 1.7117 1.7613 2.2258 1.1938 1.0593 1.1342 1.5157 2.4615 2.1799 1.6809 2.1190 4.4129 1.2714 2.3332 2.3709 2.2842 6.8406 10.1355 5.7584 5.9792 7.5939 6.9396 1.0664 1.0901 1.0858 1.0885 1.0885 1.0942 1.0943 1.0999 1.0948 1.0642
irintensity: 6.3653 1.8727 2.2771 0.0729 0.5432 0.5054 1.4436 1.9715 5.9848 2.0530 1.6395 2.3911 2.3987 31.5400 6.1698 8.5644 34.8069 5.6130 56.2939 34.4669 4.7597 44.6662 6.3316 4.5070 62.4385 44.2532 58.5924 5.3846 0.9279 23.2538 9.7775 5.1447 2.4962 2.3218 1.5993 10.6307 15.5787 329.0710 0.9913 33.8659 71.9950 216.9089 3.7264 4.6064 0.2315 6.8923 49.9363 9.9335 103.3430 39.0818 39.8573 3.9943 24.3854 19.1390 9.6081 8.9070 246.7179 112.8515 6.2920 41.9287 318.7288 55.7251 2.2280 0.5821 7.0116 13.2209 0.3543 27.5181 3.7067 38.2811 5.0744 69.5564
temp: 298.150 k
press: 1.00000 atm
elementType: 8 8 8 6 6 6 6 6 6 6 6 6 6 6 6 6 1 1 1 1 1 1 1 1 1 1
symmnumber: 1
zpe: 510140.6 jmol-1
zpe.correction: 0.194302 hartree
zpe.thermalcorrener: 0.207819 hartree
zpe.thermalcorrenthalpy: 0.208763 hartree
zpe.thermalcorrgfe: 0.152565 hartree
zpe.sumelectzpe: -725.932935 hartree
zpe.sumelectthermal: -725.919419 hartree
zpe.sumelectthermalent: -725.918475 hartree
zpe.sumelectthermalfe: -725.974673 hartree
dipole: -0.7332 -1.3898 -0.0542
dipole: 1.5723
quadrupole: -79.7285 -95.3357 -93.5379
quadrupole: 11.9988 2.6566 -4.1582
quadrupole: 9.8055 -5.8017 -4.0039 11.9988 2.6566 -4.1582
hfenergy: -726.1272378 hartree
pointgroup: C01 [X(C13H10O3)]
dipole: -0.2874868 0.4661263 -0.2876373 debye
dipolederiv: -0.5283622 -0.1129038 0.0612316 -0.2690378 -0.7967037 0.2455836 0.2064033 0.2202165 -0.4377987 -0.9031007 0.4226731 -0.1637457 0.7793077 -0.8679879 0.1675714 -0.3140474 0.1792537 -0.4803007 -1.2690598 -0.2713656 0.1401649 -0.4394438 -0.7378969 0.1816032 0.2123081 0.1874984 -0.4092916 0.9108508 0.1961561 -0.0818571 -0.0185056 -0.3331038 0.1894024 -0.0369213 0.1818717 -0.0800614 -0.3279499 -0.0113084 0.0384252 0.2669234 -0.0610081 0.0246052 -0.0142466 0.0685143 0.0303668 0.3800031 -0.0891739 -0.0165748 0.3709064 0.8747525 -0.3576224 -0.3271937 -0.3612029 0.3354542 -1.4113702 0.1031614 -0.0002393 0.1646731 0.0754913 -0.0319327 -0.0649538 -0.0435736 -0.0059468 -0.3787109 -0.0580059 0.0485894 0.1579543 -0.042402 0.0039036 -0.0090967 0.0216989 -0.0097684 -0.4088778 -0.0263397 -0.0162689 -0.5572565 0.0956265 -0.0632365 0.3043451 -0.0916275 -0.091427 0.6010092 0.0948401 -0.047947 0.0041426 0.0408663 -0.0624293 0.0168671 -0.0525464 -0.0749408 0.0983421 0.0424818 -0.090196 -0.2566074 -0.1331473 -0.0569389 0.0925239 -0.0411995 -0.0225297 0.0928955 -0.0534331 0.0761574 0.1612534 -0.0449279 -0.0922673 -0.0806011 -0.0462816 -0.0300988 2.7461963 -0.1252883 -0.0160965 -0.208235 1.1584474 -0.3884934 0.0156548 -0.4152498 0.3871425 -0.2341204 -0.0735044 0.099302 -0.1049161 -0.08741 -0.100525 0.2232923 -0.1005549 0.0122435 -0.113567 0.0835385 -0.1307719 0.1196686 -0.0829012 -0.1066396 -0.2200133 -0.0957195 0.0109261 0.0901758 -0.0102263 0.0009324 0.0170042 -0.1025881 -0.0599319 -0.05481 -0.0737199 -0.0448357 0.1499233 -0.0188999 0.036257 -0.0024611 0.0482579 -0.0492257 0.0310938 -0.0621952 0.0818631 0.1513116 -0.0349467 -0.0243248 -0.0434078 0.1308753 0.0274947 -0.0490773 0.0402448 0.0271587 0.0259219 0.0845983 -0.0271375 0.0993253 -0.0096759 0.0472603 -0.0445378 0.0549328 0.1115757 0.0630261 -0.0543702 0.0242188 -0.0496807 0.0313233 0.0555722 0.0190158 0.0553649 0.1395134 0.0407968 -0.0480421 0.0980922 -0.0234025 0.1038025 0.0767859 0.0690583 0.0607356 0.0117537 0.1282426 0.0235151 -0.0567634 -0.0112058 0.1070645 0.0765299 -0.0663127 0.0410174 0.0633315 0.0092418 0.0436992 -0.0628818 0.0829803 0.0939869 0.101476 -0.0878602 0.1069334 -0.01173 -0.0064657 -0.0399033 0.075286 -0.0696136 0.0979646 0.0951227 0.1015256 0.0948948 -0.001044 -0.1463039 0.0131135 -0.0005385 0.0139039 0.1393211 0.0315707 -0.0060163 0.0271748 0.1130617 0.2399516 -0.0800655 0.0366864 -0.1842694 0.3019726 0.0447608 0.0835998 0.043519 0.3753827 unknown
polarizability: 309.4517093|3.6477334|117.0095459|-8.19966|-37.5614274|98.7137292 unknown
InChI: InChI=1S/C13H10O3/c14-12-8-10(13(15)16)6-7-11(12)9-4-2-1-3-5-9/h1-7,15H,8H2
charge 0 multiplicity 1
26 atoms
O  -0.196966 -2.061878 1.115966
O  4.663679 -0.928691 0.291794
O  4.710438 1.214196 -0.618664
C  -0.376764 0.097964 0.009754
C  1.904959 -1.09649 0.424603
C  0.377697 -1.075835 0.56067
C  2.56766 0.143452 -0.109319
C  -1.861387 0.124694 0.003267
C  0.361101 1.171834 -0.484271
C  1.805514 1.206828 -0.539222
C  -2.54931 0.814421 -1.039872
C  -2.638014 -0.504636 1.019845
C  4.042854 0.24024 -0.187133
C  -3.95574 0.888212 -1.059674
C  -4.046485 -0.42353 0.999294
C  -4.713219 0.272252 -0.035004
H  2.157604 -1.963141 -0.222249
H  2.33286 -1.379287 1.405897
H  -0.174143 2.065879 -0.825453
H  2.310278 2.100554 -0.922491
H  -1.978457 1.261489 -1.861979
H  -2.133372 -1.05324 1.81692
H  -4.46168 1.412464 -1.877905
H  -4.624521 -0.908095 1.79379
H  -5.80743 0.326719 -0.049192
H  5.650144 -0.821673 0.22113
