program: Gaussian 09
title: 000296852
version: EM64L-G09RevD.01
frameworkgroup: C1[X(C10H13BrO8)]
method: RPBEPBE
basis: SDD
operation: Freq
keyword: #p
keyword: freq=noraman
keyword: PBEPBE/SDD
title: #p freq=noraman PBEPBE/SDD
converged: YES YES NO NO
title: Mulliken charges:
elementType: Br O O O O O O O O C C C C C C C C C C H H H H H H H H H H H H H
charge: 0.105981 -0.248667 -0.281699 -0.251413 -0.272545 -0.200629 -0.183005 -0.207466 -0.212928 -0.498378 -0.283110 0.353136 0.363008 0.252907 0.279511 -0.498043 -0.492151 -0.503386 -0.497963 0.341910 0.237543 0.251089 0.242644 0.249174 0.258359 0.230465 0.236738 0.248388 0.251424 0.247297 0.247227 0.234581
chargesum: 0.00000
title: Mulliken charges with hydrogens summed into heavy atoms:
elementType: Br O O O O O O O O C C C C C C C C C C
charge: 0.105981 -0.248667 -0.281699 -0.251413 -0.272545 -0.200629 -0.183005 -0.207466 -0.212928 -0.498378 0.058800 0.353136 0.363008 0.252907 0.279511 0.233233 0.245847 0.233164 0.231142
polarizability: 1.53705031e+02 -7.78009171e+00 1.58253107e+02 -7.00128912e-01 2.52336179e+00 1.36003774e+02
1716.lowfreq: -7.4907 -6.5048 -0.0006 0.0003 0.0005 5.0081 38.4804 44.7561 48.8901
frequency: 38.4583 44.7369 48.8608 63.8905 69.3245 72.4746 75.2859 81.9864 91.3238 96.0592 98.7890 105.0807 113.9693 123.5505 140.9544 157.9813 174.0173 191.2098 211.6223 225.3249 240.5265 246.3706 263.2494 270.7708 277.0521 316.5453 339.8982 361.1381 372.4743 543.1963 567.7332 603.4260 636.3814 670.6654 690.1186 725.9086 735.5907 786.2388 796.1547 833.8639 882.2678 893.3980 934.1679 950.5237 991.9488 1012.6598 1091.0084 1112.9656 1113.1612 1113.5031 1113.5908 1118.7606 1147.8528 1150.7576 1152.1771 1153.1508 1158.0559 1178.2721 1184.9084 1274.4781 1300.9616 1419.4078 1420.1284 1421.5227 1421.9481 1451.5520 1452.1962 1453.7973 1454.0986 1460.4500 1461.1466 1461.7173 1461.8538 1633.2154 1643.6076 1655.3162 1676.3753 3007.3704 3009.6847 3010.5436 3011.3285 3052.9454 3111.5053 3115.4349 3116.1792 3119.7534 3155.0138 3155.4201 3155.7846 3157.4389
redmass: 4.8437 5.0091 3.9619 3.8587 2.6844 3.6963 2.6727 1.8420 1.4661 1.4817 1.9025 1.3165 2.6660 5.0780 5.7204 6.3930 5.4538 4.8758 6.3960 6.0264 6.7547 8.1751 4.8631 6.3954 5.2400 4.9405 5.6805 8.0927 10.1308 7.1099 8.3621 10.0613 10.5528 5.8200 5.8470 7.1016 6.4865 6.1577 8.1967 7.5366 8.4584 7.6455 8.8492 7.7946 5.9483 5.4544 5.6588 1.3452 1.2912 1.2689 1.2694 2.4995 2.2562 1.4532 1.4968 1.4568 2.3516 7.9457 7.2818 1.5092 1.8481 1.1697 1.1773 1.1789 1.1886 1.0495 1.0496 1.0496 1.0492 1.0508 1.0510 1.0502 1.0509 10.5111 9.7389 10.1349 11.2079 1.0293 1.0291 1.0292 1.0287 1.0821 1.1048 1.1051 1.1051 1.1055 1.1052 1.1054 1.1050 1.1052
irintensity: 2.1185 0.1372 3.4157 2.4647 0.7617 1.7618 1.2487 1.0460 0.1074 0.4976 1.0240 0.0341 0.0307 0.1656 1.9025 0.1011 0.5971 3.3768 1.9707 0.5437 3.1178 2.5968 14.9508 22.7628 6.6844 19.5875 2.6320 15.5395 7.4019 22.8157 29.1362 37.6669 16.7874 5.4235 5.1842 11.9409 3.3860 11.2179 6.1904 11.1319 20.9178 3.9349 15.0716 25.6467 55.9995 78.1419 54.8829 34.8872 12.9729 0.7829 0.5728 294.0241 52.5995 11.1047 22.0207 24.7850 64.2532 314.3897 180.1565 66.8447 105.4233 16.3849 11.8089 30.8937 12.3893 9.3645 9.1403 15.2994 16.0985 9.7689 10.8547 3.6384 20.3960 180.9286 189.7813 150.6019 189.4566 28.9110 31.8524 24.9450 27.6320 3.1589 20.6009 20.0293 17.9999 15.0197 11.5584 11.6467 11.4451 14.2469
temp: 298.150 k
press: 1.00000 atm
elementType: 35 8 8 8 8 8 8 8 8 6 6 6 6 6 6 6 6 6 6 1 1 1 1 1 1 1 1 1 1 1 1 1
symmnumber: 1
zpe: 596084.3 jmol-1
zpe.correction: 0.227037 hartree
zpe.thermalcorrener: 0.250079 hartree
zpe.thermalcorrenthalpy: 0.251023 hartree
zpe.thermalcorrgfe: 0.172364 hartree
zpe.sumelectzpe: -1002.617507 hartree
zpe.sumelectthermal: -1002.594464 hartree
zpe.sumelectthermalent: -1002.593520 hartree
zpe.sumelectthermalfe: -1002.672179 hartree
dipole: -1.2353 3.1796 -3.5944
dipole: 4.9554
quadrupole: -102.2003 -113.9012 -114.2672
quadrupole: -7.3046 4.3631 9.9937
quadrupole: 7.9226 -3.7783 -4.1443 -7.3046 4.3631 9.9937
hfenergy: -1002.8445434 hartree
pointgroup: C01 [X(C10H13Br1O8)]
dipole: 0.4040888 1.8902516 -0.2540775 debye
polarizability: 152.3243743|3.421016|141.1718649|-6.3793195|-10.1101687|154.4656728 unknown
InChI: InChI=1S/C10H13BrO8/c1-16-6(12)5(7(13)17-2)10(11,8(14)18-3)9(15)19-4/h5H,1-4H3
charge 0 multiplicity 1
32 atoms
Br -0.013907 -1.624159 2.363438
O  2.121024 0.645297 1.626345
O  0.060359 -1.021972 -1.742744
O  -2.702578 1.142785 1.255292
O  1.074337 1.701431 -0.921369
O  2.797435 -0.874438 -0.007277
O  0.14395 -2.952782 -0.445103
O  -2.50965 -0.804083 -0.011784
O  -1.173512 1.888852 -1.492155
C  0.401181 -0.687285 0.593024
C  -0.509887 0.568985 0.505023
C  1.903148 -0.332005 0.672322
C  0.175305 -1.717908 -0.546988
C  -1.996682 0.19244 0.537662
C  -0.276468 1.433849 -0.756297
C  3.528723 1.08181 1.779783
C  -0.216496 -1.85431 -2.939175
C  -4.176783 0.959237 1.283889
C  1.433119 2.461091 -2.144312
H  -0.280797 1.205877 1.377801
H  3.501865 1.837461 2.576435
H  4.162118 0.224479 2.061946
H  3.890258 1.511607 0.830672
H  0.616855 -2.555992 -3.107203
H  -1.153881 -2.413438 -2.786069
H  -0.312102 -1.135742 -3.764618
H  -4.550378 1.794862 1.890767
H  -4.426564 -0.012712 1.740466
H  -4.576204 0.999152 0.257232
H  0.961925 3.457524 -2.12273
H  1.093553 1.910107 -3.036658
H  2.528833 2.534181 -2.117115
