program: Gaussian 09
title: 000296847
version: EM64L-G09RevD.01
frameworkgroup: C1[X(C18H17ClO2)]
method: RPBEPBE
basis: SDD
operation: Freq
keyword: #p
keyword: freq=noraman
keyword: PBEPBE/SDD
title: #p freq=noraman PBEPBE/SDD
converged: NO YES NO NO
title: Mulliken charges:
elementType: Cl O O C C C C C C C C C C C C C C C C C C H H H H H H H H H H H H H H H H H
charge: -0.079411 -0.304241 -0.249274 -0.190678 -0.118325 -0.423116 -0.007044 -0.494359 -0.477906 -0.464783 0.156754 0.233078 -0.526576 -0.370387 0.389361 0.382100 -0.412593 -0.416886 -0.404656 -0.241288 -0.234372 0.277092 0.256613 0.307209 0.257414 0.227084 0.253474 0.257155 0.214273 0.208537 0.257441 0.275873 0.270753 0.241516 0.244639 0.241683 0.232461 0.231386
chargesum: 0.00000
title: Mulliken charges with hydrogens summed into heavy atoms:
elementType: Cl O O C C C C C C C C C C C C C C C C C C
charge: -0.079411 -0.304241 -0.249274 0.086414 0.138288 -0.115906 0.250370 -0.013801 -0.006478 0.001195 0.156754 0.233078 -0.250703 -0.099634 0.389361 0.382100 -0.171078 -0.172247 -0.162972 -0.008827 -0.002986
polarizability: 2.99257493e+02 2.68059007e+01 2.30355751e+02 -7.91878484e+00 6.64059822e+00 1.12666845e+02
1716.lowfreq: -0.0017 -0.0010 0.0006 1.7519 7.2046 9.6469 20.8012 29.1864 42.2560
frequency: 20.7528 29.1473 42.1373 65.2768 91.9939 106.3347 173.7183 187.1342 192.1874 201.3282 222.9282 249.1328 282.6015 305.6095 339.2252 376.4079 395.5015 414.2378 437.2352 478.9299 493.1004 511.4536 526.5546 584.6876 608.1808 625.5063 632.8031 718.2165 734.2962 739.1427 755.7731 758.8422 769.5033 786.4437 790.9158 813.8186 832.6841 845.5843 850.3441 870.4281 887.6889 890.1254 911.4790 931.8111 939.5212 940.7666 948.0644 971.8491 976.9864 994.3891 1000.4021 1020.2256 1022.7443 1035.3192 1046.0599 1051.4016 1058.8027 1125.5424 1130.3725 1142.9692 1156.6778 1167.6420 1173.4742 1174.6535 1199.2531 1207.0456 1230.9834 1240.2719 1246.8441 1250.5959 1268.2366 1270.7026 1276.1065 1280.2011 1300.0411 1304.2580 1318.5698 1340.8739 1349.9363 1412.3079 1426.0167 1435.1702 1456.6418 1463.3983 1470.4576 1484.9250 1514.3053 1576.3108 1599.7551 1616.0965 1638.4800 3013.9006 3025.9547 3026.7039 3061.5801 3072.7709 3089.5036 3091.4062 3097.5264 3101.2258 3112.6782 3123.9387 3129.3973 3132.2792 3145.8734 3158.9893 3164.4051 3165.8074
redmass: 4.7861 6.4998 5.1269 7.5057 5.6601 5.7001 3.5699 3.7220 6.8918 3.6943 5.1915 4.2410 4.1642 3.1621 7.8146 4.3387 3.1325 4.4786 2.4886 2.5438 3.8893 6.8176 4.2980 5.6950 4.1825 3.8948 6.5668 2.6210 3.1030 3.9313 7.5819 4.8621 1.5751 5.1218 2.6972 1.9848 2.6966 1.3205 2.2680 4.1321 1.6253 2.7102 2.7140 2.0960 1.5850 3.6562 3.1382 1.4308 2.2397 1.3433 1.3674 1.9030 2.3426 1.9299 2.1971 2.8989 1.6311 1.6594 1.1174 1.3936 1.2099 1.6110 1.5123 1.1202 1.6597 1.3311 1.5767 1.9026 1.3249 1.3000 1.6286 1.8217 1.8455 1.4540 1.4840 1.4572 1.6020 1.4212 1.8244 5.9576 2.9834 4.0731 1.0953 2.4563 1.0776 1.0923 3.7722 7.7030 6.5957 9.0652 6.8257 1.0599 1.0614 1.0629 1.0886 1.1035 1.0916 1.0998 1.1027 1.0900 1.0936 1.0858 1.0892 1.0888 1.0952 1.0919 1.1001 1.0964
irintensity: 0.6204 0.3913 1.0588 1.5494 0.3105 0.8149 0.6058 1.6615 3.4589 3.0571 0.7595 1.6862 2.5550 3.9327 5.8871 1.8459 0.2898 23.7081 0.3645 20.7414 2.6784 0.2307 0.3611 6.6352 1.3119 0.8217 0.3467 2.4472 10.5371 2.3774 17.7300 0.8955 74.5894 14.1904 3.1453 0.2148 33.8911 28.6265 9.4028 9.3140 25.8890 4.8280 2.3912 2.2837 9.7300 51.4359 2.1851 12.0994 59.9716 0.2169 0.0676 23.9610 4.8912 1.5236 56.5553 238.5819 63.1942 88.8063 5.2129 8.2729 5.2248 11.0516 3.8485 0.0333 273.3180 4.5279 1.4219 25.5270 2.4397 3.8235 25.4299 49.1797 67.9882 6.8880 8.1170 32.2038 7.6927 4.6508 11.9576 11.2163 1.5182 1.4995 7.1585 22.5523 9.0040 13.5495 1.2858 34.0111 26.1758 199.6125 27.6866 27.4708 23.1337 46.1482 8.2314 0.8245 16.9189 31.5123 35.4782 24.3495 8.3865 2.3871 0.4573 8.2443 28.7473 2.9295 31.1431 9.8551
temp: 298.150 k
press: 1.00000 atm
elementType: 17 8 8 6 6 6 6 6 6 6 6 6 6 6 6 6 6 6 6 6 6 1 1 1 1 1 1 1 1 1 1 1 1 1 1 1 1 1
symmnumber: 1
zpe: 798213.0 jmol-1
zpe.correction: 0.304023 hartree
zpe.thermalcorrener: 0.321201 hartree
zpe.thermalcorrenthalpy: 0.322145 hartree
zpe.thermalcorrgfe: 0.256915 hartree
zpe.sumelectzpe: -1305.150677 hartree
zpe.sumelectthermal: -1305.133499 hartree
zpe.sumelectthermalent: -1305.132555 hartree
zpe.sumelectthermalfe: -1305.197785 hartree
dipole: 1.6817 0.1669 -0.1149
dipole: 1.6939
quadrupole: -111.0493 -134.5115 -130.9804
quadrupole: 11.0754 -1.8138 1.7369
quadrupole: 14.4644 -8.9978 -5.4666 11.0754 -1.8138 1.7369
hfenergy: -1305.4547 hartree
pointgroup: C01 [X(C18H17Cl1O2)]
dipole: -0.6649635 0.0236168 0.0371981 debye
polarizability: 302.4503863|-22.0936305|227.7085464|-5.7503169|-3.346468|112.1211558 unknown
InChI: InChI=1S/C18H17ClO2/c19-17-13-7-8-15(17)16(10-13)21-18(20)14-6-5-11-3-1-2-4-12(11)9-14/h1-6,9,13,15-17H,7-8,10H2
charge 0 multiplicity 1
38 atoms
Cl 4.405094 2.949438 0.357189
O  1.162291 -0.385871 -0.303026
O  0.709173 -2.671894 -0.191631
C  3.339589 0.577901 -0.88127
C  4.259895 0.185707 1.185738
C  3.469017 1.313306 0.476737
C  2.618832 -0.708344 -0.411342
C  3.245728 -0.988772 1.001682
C  4.815799 0.186718 -1.201278
C  5.456531 -0.047544 0.217609
C  0.296269 -1.484066 -0.205796
C  -1.133225 -1.07203 -0.127885
C  -1.525641 0.273265 -0.173101
C  -2.122383 -2.107363 -0.006915
C  -2.907754 0.63351 -0.100691
C  -3.905675 -0.412216 0.021138
C  -3.47339 -1.781011 0.065791
C  -3.334122 2.003137 -0.14688
C  -5.28921 -0.045646 0.091935
C  -4.689763 2.329827 -0.076081
C  -5.674559 1.296791 0.044274
H  2.811876 1.11264 -1.683469
H  4.540413 0.380046 2.231578
H  2.509508 1.575275 0.945779
H  2.726309 -1.554803 -1.10936
H  3.735146 -1.975151 1.050387
H  2.453415 -0.965702 1.77023
H  5.319749 1.011184 -1.731581
H  4.864979 -0.708895 -1.84601
H  5.873603 -1.063002 0.335431
H  6.264179 0.678371 0.40934
H  -0.765002 1.054394 -0.268585
H  -1.780397 -3.146634 0.024324
H  -4.22722 -2.57155 0.157763
H  -2.577107 2.790884 -0.239439
H  -6.043904 -0.835739 0.183779
H  -5.007582 3.377334 -0.112475
H  -6.73496 1.566707 0.098709
