program: Gaussian 09
title: 000296830
version: EM64L-G09RevD.01
frameworkgroup: C1[X(C18H18N2O)]
method: RPBEPBE
basis: SDD
operation: Freq
keyword: #p
keyword: freq=noraman
keyword: PBEPBE/SDD
title: #p freq=noraman PBEPBE/SDD
converged: YES YES NO NO
title: Mulliken charges:
elementType: O N N C C C C C C C C C C C C C C C C C C H H H H H H H H H H H H H H H H H H
charge: -0.370557 -0.311262 -0.393582 -0.404578 0.394987 -0.430103 -0.360272 0.463902 -0.475870 -0.415405 -0.361546 0.135855 -0.233789 -0.244907 -0.241285 0.295939 -0.346517 -0.362810 -0.254604 -0.235438 -0.235875 0.259270 0.222299 0.225004 0.279247 0.236450 0.214574 0.373521 0.217797 0.232993 0.258435 0.227938 0.228812 0.231063 0.222149 0.281070 0.224064 0.226069 0.226962
chargesum: 0.00000
title: Mulliken charges with hydrogens summed into heavy atoms:
elementType: O N N C C C C C C C C C C C C C C C C C C
charge: -0.370557 -0.032015 -0.020062 -0.145308 0.394987 0.017200 0.090752 0.463902 -0.258073 -0.182412 -0.103111 0.135855 -0.005850 -0.016095 -0.010222 0.295939 -0.124368 -0.081740 -0.030539 -0.009369 -0.008913
polarizability: 2.94356569e+02 -1.25971958e+01 2.26065484e+02 -1.21260292e+01 -1.63602645e+01 1.50379614e+02
1716.lowfreq: -8.9884 0.0003 0.0004 0.0005 3.1014 6.5948 20.5490 26.4145 43.5825
frequency: 20.4507 26.3567 43.5808 62.2283 74.9091 98.4634 123.3256 159.0889 201.1158 206.1806 221.6780 229.8903 268.7527 306.9801 352.4996 400.8297 401.5807 404.7642 445.8079 451.5229 462.1213 499.5017 539.6856 581.1943 608.7627 615.0847 617.2401 655.1989 674.9348 686.9257 695.7276 707.7872 739.2431 757.6942 770.7363 804.5592 831.0635 837.7010 848.0150 855.1741 856.1739 910.1374 929.6224 938.1015 976.2303 978.5838 979.7209 984.6399 986.4538 989.8428 990.6274 997.8515 1007.3165 1023.2352 1026.8763 1062.8055 1082.1522 1082.9340 1088.1121 1126.6763 1140.8779 1169.7358 1173.5132 1184.2552 1186.7470 1191.1937 1208.6887 1224.0300 1231.3725 1251.7257 1276.2970 1307.6244 1315.5353 1328.0909 1335.4683 1367.6740 1377.2718 1383.4873 1388.2326 1434.0120 1438.9672 1449.2875 1463.8817 1476.2969 1478.1397 1479.4239 1497.9473 1535.3314 1589.8758 1590.6121 1607.3954 1609.0128 1624.1682 2901.6629 2950.5106 2978.0077 3003.5027 3041.6905 3059.1151 3106.3439 3122.6365 3124.5689 3133.3244 3135.5206 3146.4230 3147.2845 3157.7625 3163.5033 3167.2509 3183.8216 3456.7351
redmass: 3.8804 5.1543 3.9373 5.1858 4.0808 4.8439 4.0835 4.1946 4.8572 5.0575 4.3942 4.1549 3.4343 3.8447 2.9145 4.2925 3.3066 2.8337 4.0215 3.0134 6.0671 4.0961 4.4802 3.7859 2.6960 6.1914 5.6379 5.2076 3.6875 1.8957 2.0607 1.7330 2.4200 1.5850 1.6665 2.7454 3.4525 3.7012 5.5042 1.2518 1.2500 1.8878 1.6699 1.4613 2.0916 1.5942 2.1947 1.3787 1.4704 5.7235 3.0668 1.3565 1.3393 2.4547 2.2485 2.2354 1.6895 1.6535 1.9926 1.8689 4.3420 1.0618 1.0636 2.6786 1.1701 1.1163 1.2417 1.5984 1.1795 1.7584 1.7676 1.3132 1.4365 1.7174 1.2576 1.5651 2.8739 5.4417 4.7341 2.1013 1.9852 1.5123 1.1998 1.1244 2.0359 2.1250 3.1214 3.6009 6.1300 5.9582 5.7989 5.8845 2.7568 1.0706 1.0856 1.0625 1.0843 1.1004 1.0913 1.0883 1.0846 1.0857 1.0884 1.0908 1.0957 1.0930 1.0958 1.1014 1.0996 1.0897 1.0752
irintensity: 0.0907 0.5876 0.5001 1.3616 1.1698 1.1700 0.1169 2.6206 0.6592 2.3592 0.5951 3.4013 8.6411 1.0813 2.6641 6.9423 3.1849 0.3269 7.4747 41.7524 6.6110 6.5306 9.1583 37.9830 65.3713 2.1211 10.6043 5.9174 53.6489 2.0295 47.3176 51.8675 18.9989 92.2505 49.9479 1.9299 1.2185 8.2034 7.9238 0.0695 0.0544 0.0355 3.4188 3.1249 14.0017 7.0082 53.3023 5.9742 41.9538 0.6933 19.7586 0.0819 1.5954 18.7618 5.6015 7.6275 2.9371 18.8673 5.9368 5.2697 21.3105 3.4806 0.2951 7.4482 25.1377 1.2457 27.1752 15.3383 1.5820 22.2311 26.9969 94.9271 14.1080 167.7895 1.5479 7.8636 40.7692 4.4397 55.5092 22.6102 4.2379 34.9665 1.3745 8.9958 14.6240 17.5459 72.7285 138.1081 10.3335 2.4087 31.0433 23.0169 672.6791 67.4669 173.5430 67.9000 20.3179 31.3974 47.3311 9.5913 1.0154 1.1792 10.4865 10.8069 35.9928 32.1255 18.0637 24.2099 25.4428 6.0295 1.4651
temp: 298.150 k
press: 1.00000 atm
elementType: 8 7 7 6 6 6 6 6 6 6 6 6 6 6 6 6 6 6 6 6 6 1 1 1 1 1 1 1 1 1 1 1 1 1 1 1 1 1 1
symmnumber: 1
zpe: 835007.1 jmol-1
zpe.correction: 0.318037 hartree
zpe.thermalcorrener: 0.335587 hartree
zpe.thermalcorrenthalpy: 0.336531 hartree
zpe.thermalcorrgfe: 0.270495 hartree
zpe.sumelectzpe: -879.949226 hartree
zpe.sumelectthermal: -879.931676 hartree
zpe.sumelectthermalent: -879.930732 hartree
zpe.sumelectthermalfe: -879.996768 hartree
dipole: 4.1289 1.2732 -0.4254
dipole: 4.3416
quadrupole: -109.4523 -114.6248 -121.6341
quadrupole: -6.7567 0.1217 -4.7619
quadrupole: 5.7848 0.6123 -6.3971 -6.7567 0.1217 -4.7619
hfenergy: -880.2672631 hartree
pointgroup: C01 [X(C18H18N2O1)]
dipole: 1.6406464 0.4521613 -0.1467815 debye
polarizability: 294.2753776|-14.2984669|224.6180923|-7.6352588|-20.7283031|151.908197 unknown
InChI: InChI=1S/C18H18N2O/c21-17(14-7-3-1-4-8-14)13-16-18(20-12-11-19-16)15-9-5-2-6-10-15/h1-10,13,18-20H,11-12H2
charge 0 multiplicity 1
39 atoms
O  -1.867669 -1.905494 0.838383
N  2.98956 -1.736822 -0.918912
N  0.658786 -2.294389 0.447874
C  1.970861 -0.644938 -0.898788
C  0.663855 -1.142614 -0.277857
C  3.119502 -2.457181 0.365387
C  1.801028 -3.207075 0.605891
C  2.49805 0.635959 -0.219667
C  -0.515716 -0.388636 -0.434862
C  3.224708 1.570785 -1.002188
C  2.356018 0.875062 1.171826
C  -1.769159 -0.800195 0.139057
C  3.810989 2.711144 -0.409886
C  2.945918 2.012336 1.767455
C  3.677344 2.932461 0.98087
C  -3.014178 0.024477 -0.05136
C  -3.026431 1.288175 -0.702077
C  -4.236305 -0.491976 0.457101
C  -4.230254 2.011494 -0.842942
C  -5.439461 0.228394 0.315097
C  -5.441838 1.484604 -0.337162
H  1.750734 -0.39823 -1.954925
H  3.336255 -1.787373 1.230659
H  3.945656 -3.184584 0.285409
H  3.889499 -1.390193 -1.275465
H  1.716607 -4.038284 -0.122218
H  1.773466 -3.636657 1.62459
H  -0.309317 -2.520561 0.810274
H  -0.446025 0.53143 -1.01682
H  3.324669 1.407559 -2.083785
H  1.758986 0.1898 1.784355
H  4.361645 3.42782 -1.029639
H  2.825525 2.18654 2.842674
H  4.127849 3.817484 1.443782
H  -2.100774 1.721424 -1.094434
H  -4.2045 -1.46329 0.961057
H  -4.224243 2.985924 -1.344407
H  -6.3740 -0.185164 0.71084
H  -6.375537 2.047683 -0.448385
