program: Gaussian 09
title: 000296851
version: EM64L-G09RevD.01
frameworkgroup: C1[X(C17H24N2O2S)]
method: RPBEPBE
basis: SDD
operation: Freq
keyword: #p
keyword: freq=noraman
keyword: PBEPBE/SDD
title: #p freq=noraman PBEPBE/SDD
converged: NO YES NO NO
title: Mulliken charges:
elementType: S O O N N C C C C C C C C C C C C C C C C C H H H H H H H H H H H H H H H H H H H H H H H H
charge: 0.947879 -0.520729 -0.540896 -0.006498 -0.486619 0.271622 0.069212 -0.424221 -0.416797 -0.587038 -0.221715 -0.417179 -0.235033 -0.729418 -0.717462 -0.038759 -0.244576 -0.225785 0.454058 -0.332844 -0.397212 -0.799947 0.233542 0.183936 0.207824 0.208021 0.218813 0.247373 0.227368 0.219531 0.229537 0.212429 0.266277 0.217674 0.203039 0.248394 0.223369 0.209523 0.287633 0.281651 0.284976 0.242197 0.243637 0.228620 0.235283 0.239311
chargesum: 0.00000
title: Mulliken charges with hydrogens summed into heavy atoms:
elementType: S O O N N C C C C C C C C C C C C C C C C C
charge: 0.947879 -0.520729 -0.540896 -0.006498 -0.198986 0.271622 0.069212 -0.006743 -0.000952 -0.120853 0.005653 0.031889 -0.022604 -0.042428 -0.036176 -0.038759 0.037075 0.059192 0.454058 -0.090647 -0.153574 -0.096733
polarizability: 3.01425277e+02 -1.61453774e+01 2.30242927e+02 7.67988120e+00 1.44850514e+01 1.86303834e+02
1716.lowfreq: -18.8717 -13.4335 -9.4697 -7.1898 0.0011 0.0017 0.0018 15.4905 16.1788
frequency: -18.6530 9.6395 14.6681 36.1494 43.7867 60.3766 64.4292 90.3627 101.5472 115.7780 124.6362 131.0780 158.6665 166.5557 198.9131 208.1905 215.8066 224.2060 248.7317 263.9591 278.4351 292.1059 311.1438 328.1289 352.9368 377.3431 391.1723 397.2025 407.0492 409.2906 428.9999 452.7086 480.9781 507.6918 520.1210 546.3037 585.8136 608.7373 622.5397 654.1668 701.8065 709.6518 722.2332 771.1729 777.4455 780.0040 804.1889 811.2069 827.3048 844.7022 848.8898 884.8250 921.8171 944.2423 947.8385 959.0389 963.9489 979.4859 982.9306 987.7143 994.7603 1000.5045 1016.4658 1033.7858 1047.2138 1050.1940 1050.2683 1057.1817 1069.8055 1097.0962 1118.1945 1120.2396 1152.2775 1162.5239 1178.1150 1184.0131 1217.3814 1231.3653 1250.7955 1266.7989 1282.4482 1290.7135 1296.9447 1312.0790 1322.4694 1339.1951 1347.7662 1377.7828 1382.3827 1392.7462 1393.3303 1394.5127 1402.1615 1455.9587 1458.5162 1462.7328 1469.3195 1470.2629 1473.9988 1474.4193 1476.2061 1478.0562 1491.5419 1493.7356 1587.3637 1595.5769 1598.0450 1671.0786 2967.5825 2968.5652 2971.0808 2981.6282 2981.8520 2982.8024 2988.1342 3021.7465 3023.1053 3045.7721 3051.8935 3061.9892 3070.5956 3076.7662 3084.4392 3090.3074 3091.2581 3092.9532 3122.9878 3133.6056 3138.9688 3163.7393 3167.5288 3201.2053
redmass: 1.0468 3.9018 4.6019 3.7790 3.8658 5.9012 2.8763 2.6517 3.3787 2.3669 3.8057 4.8267 2.7110 3.4459 3.3548 2.0351 1.7843 7.4774 1.8514 2.4297 2.7165 3.5673 3.0820 3.3268 3.0483 3.6256 6.6411 3.1382 4.0595 2.8900 4.3122 3.7459 3.4575 2.9419 3.1913 3.4155 5.3711 4.5615 6.9553 3.2873 1.6818 3.2638 1.7779 1.2600 4.2254 1.4415 3.9906 2.3781 1.3674 2.1318 1.2676 2.7541 2.3591 11.2366 2.0321 1.9717 1.3228 1.2808 1.3976 2.0470 2.3732 2.9874 2.2776 1.9795 1.8491 1.5946 2.0617 2.4860 1.7495 3.0043 1.2825 2.0551 1.3738 1.2827 2.7251 1.1357 3.0372 1.2224 1.3826 1.1951 1.2106 1.4445 1.2593 1.3979 1.3769 1.4451 2.0038 1.5509 4.6603 2.9622 1.2107 1.2072 1.3180 1.0784 1.0828 1.0899 1.0829 1.0493 1.5282 1.3828 1.1069 1.0498 1.0528 1.0489 9.4485 6.7692 6.2680 7.2315 1.0631 1.0613 1.0622 1.0535 1.0470 1.0377 1.0367 1.1008 1.0958 1.0985 1.0948 1.0973 1.0980 1.0984 1.0850 1.0999 1.0999 1.0990 1.0979 1.0894 1.0896 1.0954 1.0965 1.0733
irintensity: 0.5459 0.6673 1.1076 0.1397 0.7742 1.0170 0.2985 0.7665 1.0568 0.0099 1.3989 1.0248 0.3131 3.1565 2.3544 0.4814 0.2101 16.6209 0.0697 6.4682 10.7078 8.9832 1.4745 14.7539 11.8511 7.5571 16.1962 18.0255 24.6736 0.0913 46.5916 6.2401 2.9580 61.1331 10.6174 12.6930 19.6408 5.5577 0.1228 31.1280 29.7291 1.3326 17.8376 5.2970 3.6866 17.9342 121.7569 39.4906 31.6266 72.4010 4.6335 9.9867 11.4578 63.1040 8.9629 4.9191 0.4963 0.2237 0.4358 1.0622 13.1168 0.3039 3.0862 4.7906 7.1690 15.3676 2.2337 28.3828 1.7810 4.4106 7.5109 4.8302 2.8972 5.8801 3.4853 12.6339 5.8063 1.7253 6.9070 0.9125 11.6296 1.6059 2.5380 3.0883 1.8669 1.5971 6.2322 2.6541 3.7436 9.7051 3.9402 23.9609 13.9396 5.4472 4.1517 20.8667 19.7229 13.9391 13.5995 18.4934 16.1892 5.4379 9.0880 5.1966 51.0751 5.4096 9.5694 8.5599 36.5177 24.1416 58.9865 39.4376 9.3420 25.1180 26.5907 18.1667 43.9049 31.1562 11.8285 15.9032 34.8752 41.6297 3.7869 48.0321 22.7212 17.5867 60.1211 13.1277 9.3070 1.8034 7.6194 11.0241
temp: 298.150 k
press: 1.00000 atm
elementType: 16 8 8 7 7 6 6 6 6 6 6 6 6 6 6 6 6 6 6 6 6 6 1 1 1 1 1 1 1 1 1 1 1 1 1 1 1 1 1 1 1 1 1 1 1 1
symmnumber: 1
zpe: 984356.9 jmol-1
zpe.correction: 0.374922 hartree
zpe.thermalcorrener: 0.398469 hartree
zpe.thermalcorrenthalpy: 0.399413 hartree
zpe.thermalcorrgfe: 0.319483 hartree
zpe.sumelectzpe: -1318.328681 hartree
zpe.sumelectthermal: -1318.305134 hartree
zpe.sumelectthermalent: -1318.304190 hartree
zpe.sumelectthermalfe: -1318.384120 hartree
dipole: 0.4632 4.8051 -2.6442
dipole: 5.5041
quadrupole: -112.8865 -148.2652 -142.0548
quadrupole: -16.8096 0.0366 8.5160
quadrupole: 21.5156 -13.8630 -7.6526 -16.8096 0.0366 8.5160
hfenergy: -1318.7036024 hartree
pointgroup: C01 [X(C17H24N2O2S1)]
dipole: 0.1917294 -1.7422253 1.2716997 debye
polarizability: 300.9875435|16.8219349|234.0834146|-5.8452939|8.9839131|182.9010798 unknown
InChI: InChI=1S/C17H24N2O2S/c1-4-17(5-2)13-7-6-8-16(17)18-19-22(20,21)15-11-9-14(3)10-12-15/h7,9-13,19H,4-6,8H2,1-3H3
charge 0 multiplicity 1
46 atoms
S  -1.312447 1.977056 -0.666443
O  -0.737068 1.791283 -2.1798
O  -1.877879 3.406968 -0.130405
N  0.801581 0.468702 0.213644
N  0.059684 1.541718 0.668553
C  2.742476 -1.006542 0.060519
C  2.056489 0.269971 0.56022
C  2.099266 -1.55917 -1.253111
C  2.662979 -2.115498 1.189416
C  2.876567 1.18022 1.461778
C  4.226398 -0.725518 -0.184633
C  4.185091 1.620089 0.750093
C  4.872244 0.432957 0.103535
C  2.210913 -0.635174 -2.484755
C  1.2486 -2.64354 1.511457
C  -2.571458 0.62778 -0.348297
C  -3.522434 0.831633 0.66494
C  -2.529635 -0.517278 -1.15669
C  -4.486639 -1.36465 0.084804
C  -4.482852 -0.180231 0.871775
C  -3.503405 -1.515602 -0.927042
C  -5.535681 -2.436132 0.319227
H  1.032384 -1.76564 -1.058236
H  2.587396 -2.532328 -1.470157
H  3.125462 -1.707599 2.109972
H  3.309932 -2.957515 0.868737
H  2.303497 2.061898 1.803716
H  3.150346 0.614635 2.374667
H  4.781291 -1.556618 -0.644601
H  4.86104 2.101378 1.483295
H  3.960087 2.39018 -0.016584
H  5.939224 0.534295 -0.136394
H  1.615032 0.283706 -2.348968
H  3.25904 -0.347639 -2.686001
H  1.823835 -1.149801 -3.3840
H  0.5533 -1.8188 1.746975
H  0.819791 -3.211728 0.66745
H  1.286508 -3.321248 2.384455
H  0.548501 2.458919 0.802496
H  -3.518837 1.754442 1.253531
H  -1.773923 -0.612239 -1.94262
H  -5.2408 -0.048048 1.652729
H  -3.497069 -2.4218 -1.543012
H  -5.361499 -3.321915 -0.314308
H  -5.54082 -2.767952 1.373795
H  -6.549512 -2.055024 0.094081
