program: Gaussian 09
title: 000296829
version: EM64L-G09RevD.01
frameworkgroup: C1[X(C24H22O)]
method: RPBEPBE
basis: SDD
operation: Freq
keyword: #pfreq=noraman
keyword: PBEPBE/SDD
title: #p freq=noraman PBEPBE/SDD
converged: YES YES NO NO
title: Mulliken charges:
elementType: O C C C C C C C C C C C C C C C C C C C C C C C C H H H H H H H H H H H H H H H H H H H H H H
charge: -0.443348 -0.255847 -0.398606 -0.505918 -0.129028 0.337782 0.455216 -0.428519 0.496651 0.325203 -0.380775 -0.427896 -0.454875 -0.391783 -0.398301 -0.393707 -0.258942 -0.235177 -0.233138 -0.237395 -0.245696 -0.248411 -0.236927 -0.243641 -0.245787 0.240600 0.211351 0.252109 0.234505 0.225619 0.222935 0.252206 0.234033 0.233239 0.251957 0.333818 0.237095 0.218731 0.224837 0.224167 0.223125 0.225053 0.227897 0.226851 0.224579 0.224857 0.229304
chargesum: 0.00000
title: Mulliken charges with hydrogens summed into heavy atoms:
elementType: O C C C C C C C C C C C C C C C C C C C C C C C C
charge: -0.109530 -0.015247 -0.187255 -0.019304 0.096591 0.337782 0.455216 -0.205584 0.496651 0.325203 -0.128569 -0.193863 -0.221636 -0.139826 -0.161207 -0.174976 -0.034105 -0.011010 -0.010013 -0.012342 -0.017799 -0.021560 -0.012348 -0.018784 -0.016483
polarizability: 2.92353071e+02 -4.37513342e+00 2.40888402e+02 1.64165272e+00 4.15938604e+00 2.28346778e+02
1716.lowfreq: -11.1715 -0.0006 -0.0002 0.0006 1.2150 6.0732 22.3469 31.4661 40.2164
frequency: 21.8446 31.4039 40.1269 47.7536 51.7263 58.2483 66.7435 107.7184 131.3387 162.6530 190.6933 211.6511 234.8641 248.3972 263.5923 265.4973 277.2381 327.3446 335.3712 402.9928 404.5976 407.8646 417.4062 460.5894 484.9281 501.7570 513.4585 536.1282 564.6230 592.6567 613.7191 616.6124 619.9752 623.5937 661.5982 689.8163 698.6641 706.5027 709.4704 747.3549 761.8493 774.3731 790.2131 833.3656 837.1048 847.0950 854.5545 859.0434 869.6217 901.6455 918.2135 919.5302 927.3668 944.8646 961.2833 975.0319 976.7674 981.6735 982.9570 988.8306 990.0626 991.1266 994.2298 994.9515 997.3545 1014.6341 1028.3168 1029.7144 1035.8554 1075.2441 1083.5854 1085.6358 1102.9850 1111.0487 1153.9171 1171.6537 1171.9231 1172.9036 1181.2202 1190.0514 1193.8808 1195.0018 1200.0399 1205.2081 1242.1722 1247.4601 1267.9581 1290.6368 1301.2540 1312.4938 1319.9745 1331.2004 1331.9836 1342.2556 1357.4859 1376.7294 1382.3393 1385.5328 1393.0024 1434.9864 1438.9127 1441.2406 1470.4933 1481.2847 1484.5786 1484.7844 1581.4955 1589.8694 1591.7573 1610.1667 1611.8690 1612.6085 1648.4713 2935.2395 2978.3845 2992.1711 3014.8253 3072.9501 3089.4323 3108.8000 3109.8173 3121.7198 3122.0623 3122.5814 3128.2381 3133.2586 3135.8268 3141.0695 3143.8992 3147.3108 3149.3942 3161.4256 3161.8353 3164.7470 3548.0300
redmass: 5.4085 3.7796 4.0970 4.2233 4.3277 4.7656 5.4453 4.9714 4.6666 4.1983 4.5783 4.5869 4.3712 4.7893 2.5416 2.3581 1.6675 3.6034 4.9155 2.8344 2.8218 2.8612 3.9306 4.0183 3.8128 4.1215 3.8697 3.1089 4.1726 3.8802 5.5979 6.3508 6.0648 5.0754 4.7843 4.8996 1.7155 1.6944 1.8110 2.2376 1.8743 2.0570 2.6522 3.2382 3.6162 1.2775 1.2645 1.2510 1.4871 3.9171 1.5460 1.5080 1.4601 2.6750 2.7834 1.4220 1.4534 1.8013 2.4022 4.8516 5.6341 5.9037 1.3354 1.3608 1.3576 2.6125 2.1927 2.1684 1.9330 1.7677 1.6271 1.6390 1.8776 1.6771 1.3399 1.0584 1.0527 1.0714 1.4278 1.1168 1.1331 1.6038 1.5926 1.6860 1.2658 2.4170 1.4250 1.2128 1.6368 1.4531 1.4605 1.2688 1.4240 1.4294 1.7677 5.9791 7.0101 4.4057 1.7277 2.3031 2.1758 2.1733 1.1242 2.2479 2.1199 2.2632 5.6881 5.8897 6.0718 6.0692 6.0702 5.9805 7.6703 1.0825 1.0815 1.0816 1.0621 1.1029 1.0896 1.0877 1.0873 1.0856 1.0845 1.0858 1.0869 1.0909 1.0917 1.0918 1.0957 1.0950 1.0958 1.1014 1.1013 1.1015 1.0663
irintensity: 0.1030 0.0286 0.0159 0.1093 0.0575 0.1957 0.5408 0.0607 0.8208 1.0828 1.6075 1.4350 0.8916 1.0183 44.6198 36.0431 85.6377 16.4974 1.6510 0.0378 0.1317 0.1095 1.6525 2.7698 2.2178 1.4343 3.6107 32.7084 10.1503 9.9132 0.9367 0.6983 1.0447 3.1909 0.5310 3.5049 47.8596 53.5397 39.9870 33.4518 44.4533 39.2790 25.5659 0.1375 9.4204 0.1954 0.5315 0.3089 11.8809 20.0283 1.0725 2.0374 5.1958 7.6564 24.6853 0.8942 3.4760 17.4487 32.9545 2.5243 0.7271 0.6004 0.3061 0.1074 1.5516 17.8044 4.4488 13.7682 10.4545 5.1964 5.5753 16.6999 5.9445 21.3569 7.1292 0.1765 0.1237 0.5610 5.8296 0.7958 1.9116 1.1228 7.1651 6.9547 6.9296 10.4863 6.8863 11.4714 11.0267 2.8753 7.7931 4.7281 15.8449 14.1093 14.2228 4.6093 0.1896 0.6060 1.8689 10.2586 5.6472 7.4060 10.8357 13.2980 32.1980 17.4323 3.4480 2.0563 1.0911 5.4283 15.1432 8.3286 4.3513 43.7840 16.4845 15.5305 28.3489 36.5717 20.4453 10.4202 7.7677 0.8857 3.9938 0.1618 0.4863 12.4001 19.6890 20.4626 31.3844 40.9684 40.2243 37.1199 18.5325 22.3450 7.5341
temp: 298.150 k
press: 1.00000 atm
elementType: 8 6 6 6 6 6 6 6 6 6 6 6 6 6 6 6 6 6 6 6 6 6 6 6 6 1 1 1 1 1 1 1 1 1 1 1 1 1 1 1 1 1 1 1 1 1 1
symmnumber: 1
zpe: 1013072.3 jmol-1
zpe.correction: 0.385859 hartree
zpe.thermalcorrener: 0.406820 hartree
zpe.thermalcorrenthalpy: 0.407765 hartree
zpe.thermalcorrgfe: 0.334218 hartree
zpe.sumelectzpe: -1001.213735 hartree
zpe.sumelectthermal: -1001.192774 hartree
zpe.sumelectthermalent: -1001.191829 hartree
zpe.sumelectthermalfe: -1001.265376 hartree
dipole: 0.0064 -1.3093 -0.6928
dipole: 1.4813
quadrupole: -137.9819 -138.7906 -142.2718
quadrupole: -1.0250 2.9303 -6.9937
quadrupole: 1.6995 0.8909 -2.5904 -1.0250 2.9303 -6.9937
hfenergy: -1001.599594 hartree
pointgroup: C01 [X(C24H22O1)]
dipole: -0.0091513 0.4727349 -0.3407162 debye
polarizability: 292.568003|-3.0636753|239.3219988|0.1981346|-5.7824765|229.6982488 unknown
InChI: InChI=1S/C24H22O/c25-21-16-22(18-10-4-1-5-11-18)24(20-14-8-3-9-15-20)23(17-21)19-12-6-2-7-13-19/h1-16,21,23-25H,17H2
charge 0 multiplicity 1
47 atoms
O  0.904724 0.569521 3.807153
C  1.463113 -0.887882 0.345417
C  0.059954 -0.461138 -0.216043
C  1.479556 -0.776368 1.894623
C  1.206696 0.659265 2.352807
C  -0.50496 0.793608 0.459543
C  2.653988 -0.153897 -0.28778
C  0.04962 1.287673 1.60658
C  -0.921895 -1.644043 -0.154554
C  -1.683231 1.464525 -0.173085
C  2.562674 1.137392 -0.869338
C  3.9215 -0.795691 -0.28187
C  -0.95148 -2.577056 -1.223053
C  -1.762225 -1.870136 0.964452
C  -2.639085 2.156957 0.624718
C  -1.891516 1.439939 -1.580356
C  3.701782 1.76491 -1.425141
C  5.062252 -0.171854 -0.831483
C  -1.793624 -3.709315 -1.177049
C  -2.607095 -3.001856 1.014442
C  4.956775 1.116139 -1.407344
C  -2.625371 -3.927302 -0.053822
C  -3.737725 2.819352 0.040546
C  -2.991083 2.102099 -2.168006
C  -3.919151 2.799651 -1.362467
H  1.585966 -1.96118 0.100526
H  0.213896 -0.237344 -1.291016
H  0.692173 -1.425637 2.319367
H  2.447839 -1.11834 2.300213
H  2.115607 1.286602 2.215678
H  -0.329906 2.229844 2.029657
H  1.602911 1.664374 -0.884238
H  4.010064 -1.79969 0.153358
H  -0.310406 -2.412008 -2.099065
H  -1.762591 -1.151245 1.792078
H  0.839929 1.487698 4.176576
H  -2.534809 2.147598 1.715585
H  -1.186859 0.910093 -2.230326
H  3.607479 2.761999 -1.870787
H  6.027951 -0.690113 -0.817921
H  -1.80563 -4.416762 -2.014147
H  -3.252367 -3.159691 1.886252
H  5.838433 1.602954 -1.839108
H  -3.282741 -4.803224 -0.014974
H  -4.461992 3.337622 0.679346
H  -3.122953 2.071919 -3.255471
H  -4.775786 3.308841 -1.817774
