program: Gaussian 09
title: 000296798
version: EM64L-G09RevD.01
frameworkgroup: C1[X(C16H14O2)]
method: RPBEPBE
basis: SDD
operation: Freq
keyword: #pfreq=noraman
keyword: PBEPBE/SDD
title: #p freq=noraman PBEPBE/SDD
converged: YES YES NO NO
title: Mulliken charges:
elementType: O O C C C C C C C C C C C C C C C C H H H H H H H H H H H H H H
charge: -0.461246 -0.236946 0.190978 0.005348 0.267066 -0.329970 0.426267 -0.513612 -0.351361 -0.371545 -0.384081 -0.378686 -0.238570 -0.256398 -0.242821 -0.266244 -0.227859 -0.229294 0.267085 0.259783 0.236650 0.273243 0.305672 0.240580 0.266889 0.231391 0.232328 0.234443 0.233576 0.231503 0.235835 0.349998
chargesum: 0.00000
title: Mulliken charges with hydrogens summed into heavy atoms:
elementType: O O C C C C C C C C C C C C C C C C
charge: -0.111248 -0.236946 0.190978 0.005348 0.267066 -0.062884 0.426267 -0.017179 -0.078118 -0.065873 -0.143501 -0.111797 -0.007180 -0.024071 -0.008378 -0.032668 0.003644 0.006540
polarizability: 3.44967631e+02 -6.82245474e+00 1.74232724e+02 -5.22177942e+00 -2.44088897e+00 8.25846651e+01
1716.lowfreq: -9.1235 -2.1455 0.0006 0.0006 0.0008 4.7460 24.7645 45.0568 68.2994
frequency: 24.5840 45.0416 68.2990 85.6205 91.0964 124.4741 154.2432 182.8626 210.2929 231.3275 270.3449 294.7713 320.4681 335.8812 387.9772 408.3441 416.3653 450.3870 472.6767 529.4157 550.3656 605.6348 614.2161 620.5131 660.4159 695.4746 701.7698 714.7515 752.3658 768.3083 801.4599 812.1006 853.8499 870.3409 892.7543 925.3897 951.4182 959.3900 966.7742 976.9539 985.5348 987.3346 989.7333 999.9435 1002.7253 1011.5778 1031.2474 1034.2431 1089.1864 1093.2105 1128.8569 1173.8610 1174.6028 1184.5855 1201.7336 1208.9061 1218.7252 1252.7253 1284.7482 1328.7455 1334.1959 1360.6236 1378.3589 1382.9973 1396.5815 1433.5804 1438.4174 1481.9108 1483.8246 1497.5710 1505.0446 1576.4359 1583.0550 1605.1681 1608.3109 1615.2384 2994.9977 3087.2819 3092.4575 3117.4992 3126.5518 3129.2509 3133.0687 3142.5085 3146.5091 3155.9186 3158.8088 3167.6128 3169.9506 3554.3486
redmass: 5.4203 3.8557 5.0148 5.3877 4.8445 6.4060 6.0258 5.5395 5.6905 4.7899 4.4805 1.2051 3.1467 2.8985 5.4392 2.8866 2.7314 3.9076 4.9301 3.5851 5.7239 4.9669 6.4147 5.2317 6.4845 3.8772 1.7430 1.6487 3.8318 1.7870 2.6363 4.4518 1.2553 1.2531 5.3885 1.3712 2.4370 1.7431 1.6520 2.1518 1.4366 4.7972 4.8305 1.4264 1.3357 1.3685 2.1504 2.0648 1.6375 1.6718 1.9852 1.0703 1.1056 1.2627 1.1414 1.1930 2.3224 1.2640 3.1850 1.5516 1.3559 1.3901 2.0713 7.1616 2.1478 2.3278 2.2352 2.1868 1.9601 1.2097 6.4202 5.4134 5.7032 5.9554 5.7679 6.9475 1.0684 1.0871 1.0959 1.0906 1.0864 1.0872 1.0877 1.0916 1.0926 1.0956 1.0955 1.1002 1.1012 1.0666
irintensity: 1.2284 1.5063 0.4612 4.4453 1.0984 17.0917 12.9338 2.4216 0.3275 1.5094 1.8599 82.1280 7.6129 5.2160 0.4316 0.4815 1.8192 7.5122 4.1931 10.3104 23.0459 3.6677 0.1582 2.4963 6.4617 4.8362 61.3362 74.5938 11.8049 70.2902 13.4334 16.6694 1.3892 2.7803 65.6007 5.4153 81.0434 31.0054 37.8559 5.8576 3.6180 0.5850 0.5775 6.9052 0.6055 1.0487 4.0519 1.0254 12.3362 2.5496 18.2206 3.4407 5.7495 17.1903 35.5963 34.4559 130.0351 68.1708 272.5826 15.1312 1.8172 8.3480 8.6684 5.0235 24.2536 10.2713 16.7048 11.2296 13.5888 57.6604 98.8901 14.1649 18.8197 97.6624 12.1433 65.8991 39.7234 2.1130 19.7720 15.3634 3.1880 2.9744 0.4093 9.1907 15.6180 22.2920 18.3435 42.7591 26.3052 7.8852
temp: 298.150 k
press: 1.00000 atm
elementType: 8 8 6 6 6 6 6 6 6 6 6 6 6 6 6 6 6 6 1 1 1 1 1 1 1 1 1 1 1 1 1 1
symmnumber: 1
zpe: 664160.9 jmol-1
zpe.correction: 0.252966 hartree
zpe.thermalcorrener: 0.268538 hartree
zpe.thermalcorrenthalpy: 0.269482 hartree
zpe.thermalcorrgfe: 0.208922 hartree
zpe.sumelectzpe: -767.259564 hartree
zpe.sumelectthermal: -767.243992 hartree
zpe.sumelectthermalent: -767.243047 hartree
zpe.sumelectthermalfe: -767.303608 hartree
dipole: 1.9735 1.3783 -0.0187
dipole: 2.4072
quadrupole: -77.2227 -109.0437 -107.9865
quadrupole: -2.7548 -2.1119 -1.7593
quadrupole: 20.8616 -10.9594 -9.9022 -2.7548 -2.1119 -1.7593
hfenergy: -767.5125298 hartree
pointgroup: C01 [X(C16H14O2)]
dipole: -0.7887674 -0.4347037 -0.2929676 debye
polarizability: 344.6650157|-8.4930276|141.8141875|-6.5564108|44.2073127|115.3058177 unknown
InChI: InChI=1S/C16H14O2/c17-12-15(11-13-7-3-1-4-8-13)16(18)14-9-5-2-6-10-14/h1-11,17H,12H2
charge 0 multiplicity 1
32 atoms
O  -0.181326 -1.521161 -1.443955
O  1.046525 2.178095 1.220166
C  -0.141337 0.289119 0.298952
C  1.123864 1.068144 0.595527
C  2.482202 0.56499 0.183858
C  -1.318756 1.004577 0.399158
C  -2.726175 0.607666 0.244459
C  -0.103378 -1.197115 0.012591
C  3.602196 1.067946 0.904328
C  2.705102 -0.306134 -0.919024
C  -3.702227 1.533233 0.730061
C  -3.199855 -0.600479 -0.35765
C  4.912447 0.69667 0.547895
C  4.022506 -0.664444 -1.281799
C  -5.080937 1.257621 0.655642
C  -4.581151 -0.870937 -0.436409
C  5.127333 -0.172149 -0.550065
C  -5.528213 0.048871 0.072121
H  -1.171488 2.059452 0.678076
H  0.838779 -1.655893 0.348459
H  -0.937898 -1.700396 0.537198
H  3.415056 1.757298 1.734094
H  1.862872 -0.698148 -1.500936
H  -3.359311 2.472111 1.18124
H  -2.506131 -1.328075 -0.788478
H  5.764855 1.083702 1.116914
H  4.184252 -1.328332 -2.138201
H  -5.804651 1.982089 1.044241
H  -4.921665 -1.800446 -0.905865
H  6.146508 -0.458891 -0.833281
H  -6.599706 -0.168737 0.004401
H  -0.714791 -0.81725 -1.895016
