program: Gaussian 09
title: 000296799
version: EM64L-G09RevD.01
frameworkgroup: C1[X(C19H19NO2)]
method: RPBEPBE
basis: SDD
operation: Freq
keyword: #p
keyword: freq=noraman
keyword: PBEPBE/SDD
title: #p freq=noraman PBEPBE/SDD
converged: YES YES NO NO
title: Mulliken charges:
elementType: O O N C C C C C C C C C C C C C C C C C C C H H H H H H H H H H H H H H H H H H H
charge: -0.269197 -0.236778 -0.081070 -0.248330 -0.215379 -0.407434 0.055262 -0.742653 0.454333 0.198455 0.344077 -0.402126 -0.407689 -0.378677 -0.381409 -0.230508 -0.231140 -0.244219 -0.253000 -0.229245 -0.501714 -0.234370 0.273385 0.266417 0.287333 0.230666 0.235535 0.241841 0.250794 0.253748 0.238412 0.280347 0.223847 0.223921 0.226689 0.227267 0.229603 0.245706 0.243337 0.233328 0.230634
chargesum: 0.00000
title: Mulliken charges with hydrogens summed into heavy atoms:
elementType: O O N C C C C C C C C C C C C C C C C C C C
charge: -0.269197 -0.236778 -0.081070 0.025055 0.051038 -0.120100 0.055262 -0.034611 0.454333 0.198455 0.344077 -0.151332 -0.153941 -0.140266 -0.101062 -0.006661 -0.007218 -0.017530 -0.025733 0.000358 0.220657 -0.003735
polarizability: 2.92552037e+02 -3.35199837e-01 2.14244637e+02 -1.11490259e+01 6.82796534e+00 1.43200997e+02
1716.lowfreq: -0.0008 -0.0006 -0.0003 1.2029 4.9245 7.2816 16.3187 23.9752 36.3718
frequency: 15.3651 23.6841 36.3044 39.8010 53.9936 66.9182 97.9688 109.7544 116.4523 140.6566 170.1912 200.0647 229.0192 231.3223 242.6633 257.5051 288.0169 301.3205 345.6599 376.4662 403.8379 404.1652 431.0811 458.1727 473.4103 545.7301 565.6376 611.6680 615.3289 615.7054 660.1928 675.5563 700.6511 704.6034 708.7409 731.0137 766.9418 781.8288 793.0955 807.3557 858.3744 860.4432 879.7752 906.9657 927.9611 938.2816 955.5222 979.4156 982.8891 985.4201 988.0182 989.2525 993.2548 997.5016 1006.8089 1010.5606 1028.1144 1030.7985 1052.5153 1070.6570 1082.2470 1087.6149 1110.5811 1112.9671 1146.5259 1158.8863 1171.2056 1172.4672 1182.2707 1186.7310 1190.2991 1210.7280 1235.1728 1248.0260 1278.8249 1290.8504 1310.2905 1322.4853 1328.1965 1334.5770 1382.4866 1383.6821 1392.5946 1420.5841 1436.0731 1439.0881 1451.6937 1463.5799 1476.2595 1482.3040 1483.6105 1485.6086 1566.6855 1590.6600 1596.5763 1612.6398 1614.0425 1627.0664 2985.0571 3006.5298 3007.5919 3014.8703 3031.8143 3082.3703 3088.6964 3110.0217 3114.1376 3123.6512 3125.2482 3134.2949 3136.8927 3146.6799 3149.4803 3150.4943 3158.1187 3162.2777 3168.7063
redmass: 4.3047 5.6626 3.9488 5.2144 4.1012 4.4109 1.1109 3.3339 4.2113 3.8595 4.0641 4.6031 1.6024 1.9533 3.3116 4.8438 6.8507 4.1485 3.8885 5.6288 2.8441 2.8626 6.3415 3.8724 3.7144 3.3242 5.6874 5.5247 6.2958 6.4401 5.0093 4.5739 1.7279 4.4451 2.1071 3.8902 2.0068 2.1937 3.2840 4.4309 1.2542 1.2454 3.4776 2.9717 1.6433 1.4476 3.5391 4.3883 1.3946 2.0566 2.1479 5.4586 2.8599 1.5853 1.3835 3.5911 2.1488 1.9294 1.9168 2.3300 1.5872 1.6446 1.9226 1.3728 1.5017 2.3723 1.0532 1.0634 1.7245 1.1135 1.1742 2.0675 1.2453 1.5789 1.4125 1.5206 1.7797 1.4584 2.0342 1.3308 7.7186 7.2749 1.2154 1.1788 2.2965 2.1959 1.0502 1.0510 1.0458 1.7781 1.2425 2.3424 7.6387 6.4653 6.7911 6.0515 6.0405 10.2287 1.0353 1.0295 1.0836 1.0831 1.0846 1.1004 1.0993 1.1047 1.0870 1.0866 1.0847 1.0882 1.0922 1.0931 1.0950 1.1052 1.0961 1.1011 1.1004
irintensity: 0.6734 1.3156 0.0644 0.6967 0.1003 1.0671 0.1429 1.2752 0.3654 1.1280 2.1767 5.6903 0.2438 0.2864 0.8122 7.3515 4.5528 11.7628 2.0582 1.5059 0.0759 0.1296 4.7386 3.8449 4.4719 17.3018 2.8684 1.6414 0.1071 0.1951 3.9786 24.9473 51.6179 14.3990 31.2160 20.9464 51.2667 32.2400 4.5666 13.9591 0.7812 0.0869 9.3387 3.4958 4.4616 2.7974 1.9688 45.7795 0.2354 7.3337 2.9029 0.0367 0.9510 1.5586 2.5667 54.3144 11.8463 1.3368 1.3766 6.7950 5.6954 0.6316 35.0341 4.4036 38.9587 157.5262 0.1191 3.0171 119.5490 6.7883 22.2804 2.3094 17.4123 3.2030 16.8534 17.4253 5.5970 3.7145 38.9085 1.5980 1.2647 1.1869 17.4976 18.7902 20.9171 7.2973 13.9494 11.9720 6.5050 23.1040 14.9066 3.4772 42.9244 1.1192 9.0791 0.6390 12.0266 157.4584 22.7056 37.5474 1.8128 5.7077 7.3162 22.1425 33.0164 23.4830 4.1197 0.2169 1.6846 5.5387 21.4837 30.7811 34.0965 14.2128 19.8653 25.0137 21.1782
temp: 298.150 k
press: 1.00000 atm
elementType: 8 8 7 6 6 6 6 6 6 6 6 6 6 6 6 6 6 6 6 6 6 6 1 1 1 1 1 1 1 1 1 1 1 1 1 1 1 1 1 1 1
symmnumber: 1
zpe: 868509.7 jmol-1
zpe.correction: 0.330798 hartree
zpe.thermalcorrener: 0.350835 hartree
zpe.thermalcorrenthalpy: 0.351779 hartree
zpe.thermalcorrgfe: 0.279089 hartree
zpe.sumelectzpe: -939.045708 hartree
zpe.sumelectthermal: -939.025670 hartree
zpe.sumelectthermalent: -939.024726 hartree
zpe.sumelectthermalfe: -939.097416 hartree
dipole: -1.4776 2.0070 2.8449
dipole: 3.7822
quadrupole: -115.7085 -111.8444 -134.6965
quadrupole: 0.1423 2.4433 2.5777
quadrupole: 5.0413 8.9054 -13.9467 0.1423 2.4433 2.5777
hfenergy: -939.3765054 hartree
pointgroup: C01 [X(C19H19N1O2)]
dipole: 0.5383044 -0.9973012 0.9642819 debye
polarizability: 292.351916|-7.9568722|215.4068305|6.2235068|3.8928252|142.2389251 unknown
InChI: InChI=1S/C19H19NO2/c1-13-16(19(21)22-2)18(15-11-7-4-8-12-15)20-17(13)14-9-5-3-6-10-14/h3-13,16,18H,1-2H3
charge 0 multiplicity 1
41 atoms
O  -0.880758 -3.625899 -0.131905
O  -2.127644 -2.454119 -1.703851
N  0.257986 0.617468 -0.874466
C  -1.013925 -1.22487 0.137821
C  0.452108 -1.220862 0.68072
C  -1.128168 0.100919 -0.720493
C  1.096072 -0.10723 -0.164074
C  0.516119 -0.903583 2.199327
C  -2.079788 1.134802 -0.115549
C  -1.397681 -2.451324 -0.685327
C  2.555004 0.165361 -0.176251
C  -3.479061 0.945999 -0.256554
C  -1.607011 2.255352 0.609313
C  3.48076 -0.724816 0.433378
C  3.051072 1.330064 -0.827128
C  -4.389227 1.853225 0.328423
C  -2.517868 3.166383 1.192563
C  -3.910852 2.967248 1.0585
C  4.866468 -0.45649 0.395874
C  4.433032 1.597906 -0.860773
C  -1.264093 -4.883388 -0.823224
C  5.347825 0.706078 -0.247848
H  -1.728538 -1.19622 0.98224
H  0.934063 -2.197972 0.500267
H  -1.506977 -0.159142 -1.727442
H  0.038087 -1.714899 2.77729
H  1.557237 -0.798958 2.550763
H  -0.012924 0.040178 2.424795
H  -3.851185 0.088938 -0.832604
H  -0.527775 2.42167 0.693408
H  3.125278 -1.636493 0.925615
H  2.328752 2.00089 -1.302757
H  -5.46766 1.697216 0.209877
H  -2.140353 4.033637 1.746614
H  -4.615844 3.674602 1.509803
H  5.569619 -1.153306 0.865497
H  4.801719 2.498621 -1.364185
H  -0.91656 -4.864261 -1.869494
H  -2.360024 -5.005388 -0.808235
H  -0.766772 -5.67952 -0.251971
H  6.423185 0.914983 -0.274956
