program: Gaussian 09
title: 000296773
version: EM64L-G09RevD.01
frameworkgroup: C1[X(C14H16N2)]
method: RPBEPBE
basis: SDD
operation: Freq
keyword: #pfreq=noraman
keyword: PBEPBE/SDD
title: #p freq=noraman PBEPBE/SDD
converged: YES YES NO NO
title: Mulliken charges:
elementType: N N C C C C C C C C C C C C C C H H H H H H H H H H H H H H H H
charge: -0.075393 -0.107650 0.376267 0.392866 0.345674 -0.577199 -0.383435 -0.445981 0.065187 -0.422233 -0.412770 -0.244689 -0.243929 -0.818613 -0.595261 -0.632547 0.283799 0.229850 0.232472 0.241223 0.236876 0.225926 0.225823 0.264960 0.230633 0.239256 0.207448 0.248160 0.211422 0.218647 0.225696 0.257516
chargesum: 0.00000
title: Mulliken charges with hydrogens summed into heavy atoms:
elementType: N N C C C C C C C C C C C C C C
charge: -0.075393 -0.107650 0.376267 0.392866 0.345674 -0.293400 -0.153586 -0.213510 0.065187 -0.181009 -0.175894 -0.018762 -0.018106 -0.083764 0.071769 0.069312
polarizability: 3.15923359e+02 -3.35568381e+00 1.78416542e+02 -2.17821702e-01 1.65129663e-01 8.31329611e+01
1716.lowfreq: -12.6502 -8.6196 -0.0004 -0.0004 0.0001 1.7133 24.6385 55.0079 73.0978
frequency: 23.1424 54.9927 73.0958 115.9467 124.4593 161.0405 184.1263 195.9765 231.2035 246.9279 276.3381 287.2360 347.1513 356.0908 386.7037 401.6238 430.0548 477.9534 482.4438 488.7201 514.5331 558.4162 578.7151 625.9466 664.1447 732.1468 757.8579 759.4908 787.4493 794.3549 827.8751 854.7357 876.1999 931.8188 941.2410 960.0972 962.8320 976.1537 989.9519 1011.6761 1019.4325 1021.1320 1031.9946 1070.0597 1082.7346 1126.2713 1131.2327 1167.7966 1172.4210 1200.2913 1218.7198 1232.2548 1246.8622 1273.1864 1314.0297 1349.6824 1382.5472 1405.3405 1413.0089 1418.1735 1432.1534 1436.3885 1455.5441 1460.9525 1467.9783 1468.8892 1472.1480 1481.1719 1496.9675 1512.7881 1539.8156 1574.9778 1602.9271 1636.2529 2919.8377 2928.2623 2971.1606 3053.9452 3056.5003 3058.2441 3087.3383 3117.6702 3119.5297 3121.2271 3123.0483 3124.2877 3140.8739 3149.0246 3154.7977 3160.3305
redmass: 3.0691 3.5422 3.2832 3.2782 1.4456 2.0568 3.3485 1.2487 2.1683 3.2472 2.8120 2.2288 3.4615 2.0825 3.2849 2.9911 3.4573 2.5557 3.2954 3.9158 6.6965 3.3109 5.2704 6.2255 2.6400 3.7670 1.3517 4.5374 2.6945 5.9525 1.3681 5.2023 1.5766 4.5340 1.4470 1.6118 2.0097 1.4194 1.3521 1.6420 2.2727 2.0697 1.6611 2.0957 1.2788 1.4229 1.6437 1.1884 1.1253 2.4180 2.1803 2.3080 1.6785 1.7080 3.3979 1.8992 1.2470 4.2471 1.1783 2.6586 1.5184 3.0449 1.0598 1.5932 1.1935 1.1965 1.0717 1.0816 1.0784 3.2428 5.0802 7.5480 5.6766 6.8983 1.0518 1.0495 1.0383 1.0831 1.0897 1.0869 1.0995 1.0858 1.0986 1.0879 1.0997 1.0883 1.0950 1.0913 1.0949 1.1003
irintensity: 0.7277 2.8816 4.6972 4.9543 1.2715 2.8950 1.2874 1.4316 5.3569 0.3640 4.6153 8.3866 63.6017 9.1204 2.5731 3.6506 4.5008 24.0549 36.0320 1.7801 0.0169 3.6029 4.1328 1.5828 1.3799 5.2612 49.2133 1.4332 1.3226 21.0446 52.0797 7.0818 17.2533 23.4191 8.1702 19.5659 25.5249 12.5765 0.1869 20.6786 59.6136 42.1768 24.0964 0.8996 1.7120 23.6647 14.5331 0.3291 0.7538 23.7417 3.9875 2.8293 0.4154 7.5409 16.6627 3.4320 42.8309 0.7464 3.4750 0.6268 2.0050 8.8362 13.9393 1.6538 12.6202 10.6821 7.0107 58.5629 15.5636 6.4275 42.4857 2.8012 7.0070 3.9768 79.8823 196.9134 18.7862 9.7283 18.4674 66.1164 17.8348 2.4247 18.3552 10.4366 17.2970 1.5381 31.6868 6.2493 24.5095 40.8210
temp: 298.150 k
press: 1.00000 atm
elementType: 7 7 6 6 6 6 6 6 6 6 6 6 6 6 6 6 1 1 1 1 1 1 1 1 1 1 1 1 1 1 1 1
symmnumber: 1
zpe: 694151.5 jmol-1
zpe.correction: 0.264388 hartree
zpe.thermalcorrener: 0.279335 hartree
zpe.thermalcorrenthalpy: 0.280279 hartree
zpe.thermalcorrgfe: 0.221914 hartree
zpe.sumelectzpe: -651.403035 hartree
zpe.sumelectthermal: -651.388088 hartree
zpe.sumelectthermalent: -651.387144 hartree
zpe.sumelectthermalfe: -651.445509 hartree
dipole: -1.7798 0.7803 0.7609
dipole: 2.0870
quadrupole: -76.7975 -84.3150 -100.8269
quadrupole: 0.1256 -2.9680 0.7259
quadrupole: 10.5157 2.9981 -13.5138 0.1256 -2.9680 0.7259
hfenergy: -651.6674229 hartree
pointgroup: C01 [X(C14H16N2)]
dipole: 0.7046602 -0.2606135 0.3312734 debye
polarizability: 315.9692897|-2.1970696|176.7981753|-0.7685721|-12.1194979|84.7053976 unknown
InChI: InChI=1S/C14H16N2/c1-11(15-16(2)3)13-9-8-12-6-4-5-7-14(12)10-13/h4-10H,1-3H3
charge 0 multiplicity 1
32 atoms
N  2.549294 0.553463 -0.242031
N  3.97204 0.638959 -0.305875
C  -1.679983 0.558557 -0.127644
C  -2.391115 -0.683509 0.111312
C  0.484615 -0.643844 -0.070563
C  -0.25528 0.546898 -0.205602
C  -0.234171 -1.868615 0.172658
C  -1.625826 -1.885101 0.262229
C  1.974241 -0.640588 -0.165212
C  -2.438517 1.770448 -0.277459
C  -3.822362 -0.666373 0.191854
C  -3.831874 1.756821 -0.195374
C  -4.531152 0.52809 0.04153
C  2.72288 -1.959996 -0.258429
C  4.348863 2.023315 -0.673302
C  4.71956 0.164493 0.891025
H  0.291624 1.480482 -0.373081
H  0.317981 -2.804713 0.304312
H  -2.152199 -2.828239 0.452974
H  -1.901925 2.709516 -0.458402
H  -4.354761 -1.608138 0.372918
H  -4.399835 2.686565 -0.31169
H  -5.625084 0.532391 0.103645
H  3.685919 -1.793509 -0.772929
H  2.929109 -2.414487 0.73054
H  2.138782 -2.692234 -0.84138
H  4.145967 2.750018 0.144892
H  3.773602 2.325638 -1.560675
H  5.42503 2.047903 -0.919018
H  4.443476 0.74587 1.800061
H  5.798788 0.295359 0.701939
H  4.533212 -0.900643 1.088078
