program: Gaussian 09
title: 000296729
version: EM64L-G09RevD.01
frameworkgroup: C1[X(C10H8Cl2N2)]
method: RPBEPBE
basis: SDD
operation: Freq
keyword: #p
keyword: freq=noraman
keyword: PBEPBE/SDD
title: #p freq=noraman PBEPBE/SDD
converged: YES YES NO NO
title: Mulliken charges:
elementType: Cl Cl N N C C C C C C C C C C H H H H H H H H
charge: -0.001406 0.018580 -0.080910 0.054887 -0.126136 -0.362917 -0.355126 -0.174352 0.397854 -0.384249 -0.382950 -0.222051 -0.220440 -0.236119 0.295647 0.279544 0.271413 0.275726 0.263679 0.229355 0.229497 0.230473
chargesum: 0.00000
title: Mulliken charges with hydrogens summed into heavy atoms:
elementType: Cl Cl N N C C C C C C C C C C
charge: -0.001406 0.018580 -0.080910 0.054887 0.169511 -0.083373 -0.083712 -0.174352 0.397854 -0.108523 -0.119270 0.007304 0.009057 -0.005647
polarizability: 1.77181178e+02 3.64022642e+00 1.44145687e+02 7.67836511e-01 1.04475716e+01 8.14330228e+01
1716.lowfreq: -6.0568 -2.8270 -0.0040 -0.0037 -0.0035 3.2154 27.4088 56.2855 85.4807
frequency: 27.3952 56.2801 85.4770 114.7151 173.8912 202.7135 245.8859 250.8634 293.8795 348.4691 377.3762 403.5201 452.3088 495.2945 561.6193 614.8063 620.2782 697.6714 707.4539 725.9915 749.4939 766.3695 818.3741 849.5997 862.8427 870.7157 919.8771 941.6088 964.2716 986.8759 989.6411 1001.5443 1029.8854 1035.9100 1057.8778 1077.8336 1084.5277 1172.8267 1177.4653 1187.0670 1200.6804 1215.1530 1235.5007 1272.1505 1292.3653 1317.4793 1381.7698 1434.9456 1481.6269 1560.0441 1593.3263 1614.2622 2998.2049 3126.9066 3130.6853 3138.3542 3152.5937 3162.7414 3170.7251 3190.9176
redmass: 4.2115 7.8691 7.9035 12.8858 5.8307 5.3173 6.7783 6.4980 6.2333 8.9421 8.9418 2.8768 3.7818 6.8741 6.8700 6.4384 5.7436 5.7285 2.8802 2.5533 3.5816 3.2637 7.4657 4.8968 1.2716 3.6525 6.7489 1.5835 4.7601 1.3821 5.9722 1.3178 2.0918 1.3074 1.3617 2.2160 1.6556 1.0528 2.5598 1.1392 1.2320 1.9011 1.2271 2.2893 1.7135 1.3150 8.8009 2.2275 2.3076 10.3138 6.4061 6.0428 1.0839 1.0850 1.0905 1.0890 1.0934 1.0956 1.1002 1.0940
irintensity: 0.0038 0.3039 0.1699 0.2130 4.9776 2.5049 1.5588 2.4282 5.9988 4.7124 8.4733 0.0145 2.3707 13.7898 2.3360 0.1476 21.9300 13.0028 37.1016 44.3028 78.3407 30.6857 5.5430 34.2916 0.3174 15.0379 37.9437 7.5441 45.3052 0.2390 0.4267 0.3258 7.4476 16.1693 10.4563 92.0499 6.1917 0.2305 66.6683 1.6892 3.6210 7.5778 10.6468 145.6036 61.5724 0.9423 0.4362 13.5755 15.1241 181.7325 4.7062 4.0639 9.2591 0.0110 3.8045 12.4573 21.4067 13.6283 16.1827 0.7406
temp: 298.150 k
press: 1.00000 atm
elementType: 17 17 7 7 6 6 6 6 6 6 6 6 6 6 1 1 1 1 1 1 1 1
symmnumber: 1
zpe: 410743.4 jmol-1
zpe.correction: 0.156444 hartree
zpe.thermalcorrener: 0.168326 hartree
zpe.thermalcorrenthalpy: 0.169270 hartree
zpe.thermalcorrgfe: 0.116262 hartree
zpe.sumelectzpe: -1414.418457 hartree
zpe.sumelectthermal: -1414.406575 hartree
zpe.sumelectthermalent: -1414.405631 hartree
zpe.sumelectthermalfe: -1414.458639 hartree
dipole: 0.7598 0.0089 0.3257
dipole: 0.8267
quadrupole: -89.1045 -101.0064 -92.3478
quadrupole: -2.2575 -1.8245 0.2080
quadrupole: 5.0484 -6.8535 1.8052 -2.2575 -1.8245 0.2080
hfenergy: -1414.574901 hartree
pointgroup: C01 [X(C10H8Cl2N2)]
dipole: -0.2922385 0.082811 -0.1162986 debye
dipolederiv: -0.3550481 0.2807062 0.0848057 0.4779065 -0.6957398 -0.1537939 0.0712405 -0.0794892 -0.167452 -0.4185228 -0.2703368 -0.2405912 -0.3817668 -0.438111 -0.2703285 -0.3289525 -0.2265203 -0.238263 -0.9624402 0.2857311 -0.0620115 0.0236453 -0.3602409 -0.0198847 -0.0135835 0.0158911 -0.155334 -0.807907 -0.2107176 -0.2236008 0.2095166 -0.6140929 -0.0012211 -0.3579804 -0.0466741 -0.4357183 0.0314274 -0.0140479 -0.0636318 0.1146557 -0.322173 -0.1831741 -0.0382895 -0.3316505 0.0447126 0.6722654 -0.5227525 -0.1279224 -0.5631201 0.9725748 0.231668 -0.2295314 0.3254259 0.2598229 0.9260345 -0.082043 0.0454519 -0.1319858 0.4049126 0.0386052 0.2266734 -0.0464803 0.3072041 0.885434 0.4773397 0.5947902 0.2055388 1.0314521 0.3692685 0.7457664 0.3628395 0.4313713 0.0928566 0.0000568 -0.0237393 -0.0376786 -0.0770862 -0.0555683 -0.1790949 -0.0111473 -0.0535289 -0.1635066 -0.0979484 -0.0277476 0.0100596 -0.0048211 0.0031362 0.0018472 -0.0072014 -0.1197932 -0.1101205 0.0897313 -0.0264049 -0.0079437 0.0260308 -0.0261775 0.0124773 -0.0152609 -0.1274906 -0.0371831 0.0889905 -0.0456542 0.0851761 0.0863595 -0.0543111 -0.0288449 -0.0522788 -0.133179 -0.0315285 -0.1037632 -0.0287225 -0.1042131 0.0736067 -0.003102 -0.0125093 0.0065171 -0.1434691 0.0712999 0.0021768 -0.0713489 0.0028227 -0.0532623 -0.0141324 -0.0561869 -0.0129497 -0.1353547 0.1091433 -0.0149841 -0.0388448 0.0229671 0.0558333 0.0041668 -0.0554889 0.0210961 0.0184294 0.0348864 0.0679282 0.0214567 0.0537981 -0.0811803 0.0691 0.0593188 0.0207425 0.0122813 -0.0888497 0.007465 0.0569138 -0.0085695 0.0330102 -0.021006 0.0107764 -0.0019175 -0.0748913 0.134333 0.0701128 0.0175155 0.0890693 0.009082 0.0022415 0.0021325 0.0008446 0.1402169 0.117417 -0.0718978 0.0393589 -0.0734473 -0.0064736 0.0274111 0.0279139 0.023912 0.1368919 0.0228428 -0.0700788 0.0326796 -0.0934366 -0.0697415 0.0473185 0.0459724 0.0475665 0.1419822 0.004811 0.0918103 0.0189668 0.1108965 -0.0613781 0.0008263 0.0227494 -0.0010848 0.1511654 -0.1276448 -0.0034785 0.0682808 -0.0038909 0.0914386 0.0089576 0.0735939 0.0078195 0.1403962 unknown
polarizability: 175.6376358|-7.7507882|145.7441755|-0.4228723|10.3833804|81.3780772 unknown
InChI: InChI=1S/C10H8Cl2N2/c11-8-7-9(12)14(7)10(13-8)6-4-2-1-3-5-6/h1-5,7,9-10H
charge 0 multiplicity 1
22 atoms
Cl 3.250534 -2.813774 -0.760639
Cl 3.027426 2.151955 1.382088
N  1.070493 -1.097725 -0.218487
N  0.981169 1.366616 -0.247165
C  2.186992 -0.485735 0.647808
C  2.469023 -1.145236 -0.689378
C  0.288023 0.120363 -0.741731
C  1.960499 0.99406 0.515682
C  -1.166341 0.080587 -0.285964
C  -1.780142 -1.155826 0.027332
C  -1.92205 1.277991 -0.226823
C  -3.145367 -1.193794 0.390237
C  -3.285833 1.234517 0.137053
C  -3.902295 -0.00097 0.444279
H  2.463776 -0.946124 1.596878
H  2.802647 -0.54409 -1.542618
H  0.35276 0.115651 -1.848078
H  -1.180701 -2.070765 -0.003087
H  -1.435965 2.23284 -0.450976
H  -3.615177 -2.153367 0.633223
H  -3.864885 2.163441 0.184573
H  -4.960486 -0.032717 0.726989
