program: Gaussian 09
title: 000296719
version: EM64L-G09RevD.01
frameworkgroup: C1[X(C4H5NO2S)]
method: RPBEPBE
basis: SDD
operation: Freq
keyword: #p
keyword: freq=noraman
keyword: PBEPBE/SDD
title: #p freq=noraman PBEPBE/SDD
converged: YES YES NO NO
title: Mulliken charges:
elementType: S O O N C C C C H H H H H
charge: 0.982529 -0.525003 -0.536668 0.022151 -0.142413 -0.584265 -0.584277 -0.157364 0.325346 0.293389 0.306590 0.306594 0.293389
chargesum: 0.00000
title: Mulliken charges with hydrogens summed into heavy atoms:
elementType: S O O N C C C C
charge: 0.982529 -0.525003 -0.536668 0.022151 0.182934 0.015714 0.015707 -0.157364
polarizability: 1.06926120e+02 2.79594060e+00 6.73602687e+01 -6.59325244e-04 2.52880920e-04 5.80724106e+01
1716.lowfreq: -6.1491 0.0010 0.0026 0.0032 6.6374 16.5933 53.8984 140.8831 180.3483
frequency: 53.8974 140.8825 180.3443 189.7745 261.9563 266.7565 280.9794 434.1815 503.8430 525.1777 566.4161 567.1993 766.2691 805.4623 831.6564 864.8292 969.3468 984.3655 994.9922 1044.6133 1127.1686 1133.9429 1165.5076 1256.0656 1308.4535 1406.5760 1422.2057 2201.2580 3047.7560 3073.5379 3075.7620 3187.0559 3189.0056
redmass: 7.1260 7.9217 3.5443 8.0018 5.8946 4.5920 4.0439 16.4828 8.1057 4.4499 3.0892 7.1226 1.3016 5.4080 3.6426 2.5323 1.0364 3.9298 5.1538 2.7601 1.4880 1.2357 1.3037 1.1790 1.4155 1.0942 1.1147 12.5598 1.0845 1.0548 1.0560 1.1144 1.1153
irintensity: 15.2846 15.7919 0.5909 0.1548 8.3822 5.0616 6.6772 13.1213 12.7096 0.1691 6.4721 42.2611 3.0334 64.3652 6.4941 31.5408 0.8175 75.9305 0.1858 8.6542 0.0881 2.0841 10.4070 5.1206 0.6087 22.7166 3.4131 9.1016 0.4830 0.1527 0.9302 0.3380 0.1263
temp: 298.150 k
press: 1.00000 atm
elementType: 16 8 8 7 6 6 6 6 1 1 1 1 1
symmnumber: 1
zpe: 226257.1 jmol-1
zpe.correction: 0.086177 hartree
zpe.thermalcorrener: 0.094654 hartree
zpe.thermalcorrenthalpy: 0.095598 hartree
zpe.thermalcorrgfe: 0.052487 hartree
zpe.sumelectzpe: -757.868970 hartree
zpe.sumelectthermal: -757.860493 hartree
zpe.sumelectthermalent: -757.859549 hartree
zpe.sumelectthermalfe: -757.902660 hartree
dipole: 2.1061 -1.1657 0.0000
dipole: 2.4072
quadrupole: -82.4706 -58.7823 -47.6945
quadrupole: -2.9894 -0.0007 -0.0021
quadrupole: -19.4881 4.2001 15.2880 -2.9894 -0.0007 -0.0021
hfenergy: -757.9551469 hartree
pointgroup: C01 [X(C4H5N1O2S1)]
dipole: -0.8137966 -0.4844102 0.0032244 debye
dipolederiv: 1.4234329 0.0085486 -0.0002654 0.0121092 1.2217389 -0.0004682 -0.0003146 -0.0004471 1.1391508 -0.631837 -0.0356154 0.0003253 -0.2767689 -0.6509865 0.0012379 0.0016672 0.001036 -0.4677094 -0.6582272 0.0124649 0.0000597 0.2661044 -0.6083216 0.0004901 -0.0013513 0.0006763 -0.4844556 -0.279826 -0.0473971 0.0002464 0.0471869 -0.1831445 -0.000097 -0.0002188 -0.0000441 -0.198239 0.0344555 0.0041271 -0.0000766 0.1036707 0.2091307 -0.0014337 -0.000635 -0.0013577 -0.0323134 -0.1103406 0.0112201 0.1450768 0.0059909 -0.0419295 0.0002036 0.1422661 -0.0302787 -0.1100058 -0.1107333 0.0096369 -0.1451898 0.0043903 -0.041603 -0.000977 -0.1423036 0.0294795 -0.1099413 0.1846963 -0.0465704 0.000179 -0.1547761 -0.0565209 0.0001894 0.0007401 0.0001184 -0.0396836 0.0202235 0.0237441 -0.000076 -0.0121816 0.0047891 0.000508 0.0001225 0.0004796 0.093257 0.0272975 0.0379961 0.0524813 -0.0051123 0.0077823 -0.0140368 0.0166334 -0.0171651 0.0828135 0.036846 -0.0075798 0.0341563 0.0073256 0.0660473 0.0673639 -0.0087962 0.0367688 0.0216758 0.0368205 -0.0080092 -0.0340729 0.0073382 0.0648548 -0.0678722 0.0086956 -0.0372415 0.0228983 0.0271918 0.037434 -0.052844 -0.0052773 0.0081627 0.014892 -0.0165055 0.0179754 0.0825528 unknown
polarizability: 107.0626197|-1.5483346|67.2234858|-0.0294044|-0.048264|58.0726941 unknown
InChI: InChI=1S/C4H5NO2S/c5-1-4-2-8(6,7)3-4/h4H,2-3H2
charge 0 multiplicity 1
13 atoms
S  1.623738 0.156202 -0.002338
O  2.356483 1.606395 -0.010928
O  2.465038 -1.240134 0.004821
N  -3.321393 0.287319 0.00071
C  -0.786947 -0.525398 0.003253
C  0.049437 0.018629 1.20699
C  0.047693 0.00504 -1.20773
C  -2.185602 -0.078012 0.001728
H  -0.758306 -1.629101 0.009454
H  -0.19937 1.045735 1.511489
H  0.229771 -0.662397 2.047843
H  0.226872 -0.685481 -2.041055
H  -0.201614 1.028601 -1.523538
