program: Gaussian 09
title: 000296781
version: EM64L-G09RevD.01
frameworkgroup: C1[X(C21H17NO5)]
method: RPBEPBE
basis: SDD
operation: Freq
keyword: #p
keyword: freq=noraman
keyword: PBEPBE/SDD
title: #p freq=noraman PBEPBE/SDD
converged: YES YES NO NO
title: Mulliken charges:
elementType: O O O O O N C C C C C C C C C C C C C C C C C C C C C H H H H H H H H H H H H H H H H H
charge: -0.288938 -0.246694 -0.254332 -0.240704 -0.229986 -0.485315 0.220253 -0.022822 0.172762 0.160241 0.299869 -0.031458 0.158322 0.099131 0.346993 -0.351481 -0.406613 -0.242507 -0.237010 -0.377613 -0.358517 -0.235384 -0.250344 -0.236717 -0.236589 -0.499241 -0.506762 0.360621 0.273793 0.247709 0.231025 0.232658 0.276806 0.267590 0.233912 0.241331 0.232275 0.233532 0.244364 0.227809 0.248365 0.252698 0.244329 0.232640
chargesum: 0.00000
title: Mulliken charges with hydrogens summed into heavy atoms:
elementType: O O O O O N C C C C C C C C C C C C C C C C C C C C C
charge: -0.288938 -0.246694 -0.254332 -0.240704 -0.229986 -0.124693 0.220253 -0.022822 0.172762 0.160241 0.299869 -0.031458 0.158322 0.099131 0.346993 -0.077688 -0.158905 -0.011482 -0.004352 -0.100807 -0.090927 -0.001472 -0.009013 -0.004442 -0.003058 0.221297 0.222905
polarizability: 4.14062808e+02 -1.10805004e+01 2.50445101e+02 1.10540321e+01 3.26298231e+01 1.57106185e+02
1716.lowfreq: -4.8555 -1.6401 -0.0010 -0.0008 -0.0007 4.8594 15.9997 27.8967 37.8441
frequency: 15.9077 27.8862 37.8282 41.2931 44.1615 53.8274 68.1840 82.4914 97.8226 99.4785 107.1269 113.5096 129.8350 135.0080 154.4230 185.5468 192.1237 211.1662 234.3385 244.4552 248.3360 258.7074 288.7006 323.9292 327.9460 379.1675 402.0813 407.6593 409.3582 432.9328 459.7185 480.8456 517.2769 571.0221 608.3106 614.2997 614.3522 643.0449 664.8381 672.4329 684.6047 702.6174 703.0255 726.5419 735.4285 747.3335 753.4675 767.5034 775.5612 788.0544 802.3998 852.9336 863.0447 882.8988 910.3252 929.3530 931.8327 945.3891 979.1163 988.3008 988.9130 989.0911 998.9941 999.4061 1004.5239 1025.2821 1032.1482 1063.1482 1085.2209 1086.1367 1111.1005 1113.1555 1115.0576 1148.2414 1150.9879 1163.8333 1174.2489 1175.7152 1190.0942 1197.1753 1210.7374 1248.9387 1286.6153 1319.7621 1322.7314 1350.4601 1377.0512 1383.3552 1402.2234 1411.1528 1422.0943 1432.1959 1434.2803 1448.6498 1450.0368 1452.4260 1459.4156 1463.9583 1468.8346 1479.2048 1503.7223 1516.1088 1542.7985 1582.6454 1586.2303 1608.5609 1613.1891 1616.0568 1635.7737 3004.3744 3006.0301 3108.8434 3109.5994 3123.4163 3129.8967 3133.1942 3141.3409 3147.1919 3147.4853 3151.9451 3152.0968 3161.7802 3164.4086 3170.9873 3191.2719 3540.8927
redmass: 5.4682 5.4752 4.6374 5.4050 4.2203 4.9013 4.9663 3.9647 1.9967 1.6106 1.5391 3.5036 3.4239 4.7920 4.8717 5.5086 5.3227 5.6799 5.6524 6.9968 5.7501 6.5922 4.1638 7.2874 6.2468 5.5692 8.0538 2.9284 2.9257 4.6233 7.5855 4.8598 5.7155 5.7287 6.8419 6.4946 6.5041 7.2216 6.7377 7.3074 5.4465 1.8387 1.9789 2.3750 3.8544 1.7085 5.4096 4.2256 4.6743 2.4675 2.9472 1.2459 1.2493 7.1926 8.4229 1.7425 3.0349 1.5998 1.4284 1.4460 5.4154 5.3053 6.2214 1.3450 1.3591 2.3197 2.2452 4.9335 1.6250 1.6562 1.3189 1.3260 3.3199 1.4934 1.4637 3.5778 1.0578 1.0599 1.1201 1.1534 3.0617 3.5036 3.5356 1.3727 1.5142 4.0564 7.2975 8.4167 3.3217 1.4989 1.4468 2.1246 2.3391 2.9175 1.0522 1.0736 1.0527 1.1363 2.6368 2.3128 6.6647 7.1109 5.5718 5.8779 6.0947 6.0061 6.7870 8.7355 10.8470 1.0294 1.0291 1.1045 1.1048 1.0868 1.0853 1.0879 1.0883 1.0994 1.0993 1.1023 1.0951 1.0962 1.0997 1.1011 1.0953 1.0803
irintensity: 3.0594 0.6940 0.0015 2.2325 1.7360 1.8893 0.1589 0.2126 0.0850 0.0048 0.6514 0.2490 1.0133 2.1935 7.2097 5.8986 1.0231 4.3088 2.7811 1.5177 1.4553 1.4030 21.0685 4.8409 9.8580 3.5102 5.3178 0.6793 0.3173 3.1562 20.0945 0.3997 16.0084 10.7717 5.8059 0.6514 2.2659 13.3644 0.6732 28.7282 3.3460 30.9056 59.5800 53.2959 56.7163 49.3245 8.1548 42.0425 4.9949 9.0159 18.4881 3.1750 2.5890 21.8709 3.0982 6.8883 35.1591 7.1296 6.4560 2.7108 2.2771 1.3621 48.0234 1.2850 0.4669 15.9495 41.8196 131.6747 13.6012 13.5255 7.4747 7.6610 135.8561 49.9337 11.0135 69.5439 1.0496 0.9228 22.4979 10.2707 13.1667 571.7901 45.8848 6.5085 45.2945 53.3333 13.1945 2.1778 89.4452 7.0190 23.6371 19.8834 61.1425 150.4462 13.2202 25.7769 7.1746 23.9239 104.7511 12.6128 63.7661 145.8709 58.1282 0.2732 5.6546 25.7635 65.1210 167.4034 181.4682 29.4563 38.9672 18.5768 21.4935 5.0397 0.4491 1.5075 5.8773 5.0471 34.3229 11.2197 18.5337 16.5315 33.2791 20.7580 4.4949 81.0511
temp: 298.150 k
press: 1.00000 atm
elementType: 8 8 8 8 8 7 6 6 6 6 6 6 6 6 6 6 6 6 6 6 6 6 6 6 6 6 6 1 1 1 1 1 1 1 1 1 1 1 1 1 1 1 1 1
symmnumber: 1
zpe: 870268.6 jmol-1
zpe.correction: 0.331468 hartree
zpe.thermalcorrener: 0.356317 hartree
zpe.thermalcorrenthalpy: 0.357261 hartree
zpe.thermalcorrgfe: 0.273765 hartree
zpe.sumelectzpe: -1239.424034 hartree
zpe.sumelectthermal: -1239.399185 hartree
zpe.sumelectthermalent: -1239.398241 hartree
zpe.sumelectthermalfe: -1239.481737 hartree
dipole: 1.5789 -0.1595 0.0829
dipole: 1.5891
quadrupole: -109.9156 -157.8356 -154.8643
quadrupole: -4.2340 4.4239 2.4853
quadrupole: 30.9562 -16.9638 -13.9925 -4.2340 4.4239 2.4853
hfenergy: -1239.755502 hartree
pointgroup: C01 [X(C21H17N1O5)]
dipole: -0.6158201 -0.1049287 0.0255823 debye
polarizability: 411.9727173|24.9581779|200.5015348|-0.1755866|-57.2918768|209.1398417 unknown
InChI: InChI=1S/C21H17NO5/c1-26-20(24)15-16(21(25)27-2)18(19(23)14-11-7-4-8-12-14)22-17(15)13-9-5-3-6-10-13/h3-12,22H,1-2H3
charge 0 multiplicity 1
44 atoms
O  -3.1189 1.457276 -1.462371
O  1.963639 2.030207 0.127912
O  1.671649 -2.32194 1.75297
O  -1.303529 2.845587 -1.025092
O  1.379042 1.723066 -2.108653
N  -0.616739 -1.372729 0.652091
C  -1.697023 -0.658998 0.168706
C  -1.150367 0.49422 -0.476902
C  0.601206 -0.763463 0.337602
C  0.283092 0.426038 -0.354956
C  -3.061875 -1.148061 0.457658
C  1.817611 -1.437959 0.83585
C  -1.823242 1.70177 -0.994074
C  1.231549 1.442453 -0.896977
C  3.171023 -1.135196 0.281307
C  -4.089455 -1.160808 -0.523286
C  -3.337536 -1.691316 1.746514
C  -5.355666 -1.704379 -0.221079
C  -4.60586 -2.230693 2.044866
C  3.372916 -0.788292 -1.080831
C  4.295399 -1.295307 1.135071
C  -5.620945 -2.241387 1.060162
C  4.680345 -0.58338 -1.573133
C  5.597609 -1.076391 0.645176
C  5.793673 -0.717765 -0.711445
C  -3.846571 2.65684 -1.94374
C  2.953243 3.047311 -0.305367
H  -0.648766 -2.252158 1.174814
H  -3.885265 -0.749448 -1.513814
H  -2.569145 -1.656088 2.528496
H  -6.135354 -1.714818 -0.990585
H  -4.803773 -2.633241 3.044182
H  2.522878 -0.710079 -1.766003
H  4.124178 -1.593587 2.174582
H  -6.606433 -2.661341 1.289594
H  4.827444 -0.327438 -2.627822
H  6.459117 -1.189415 1.312262
H  6.807174 -0.555025 -1.095191
H  -3.926985 3.404474 -1.137105
H  -4.837135 2.283009 -2.239172
H  -3.314985 3.103636 -2.800264
H  2.448746 3.841107 -0.880544
H  3.729103 2.572735 -0.93008
H  3.37891 3.436971 0.629468
