program: Gaussian 09
title: 000296771
version: EM64L-G09RevD.01
frameworkgroup: C1[X(C20H25NO)]
method: RPBEPBE
basis: SDD
operation: Freq
keyword: #p
keyword: freq=noraman
keyword: PBEPBE/SDD
title: #p freq=noraman PBEPBE/SDD
converged: YES YES NO NO
title: Mulliken charges:
elementType: O N C C C C C C C C C C C C C C C C C C C C H H H H H H H H H H H H H H H H H H H H H H H H H
charge: -0.506163 -0.229753 -0.268544 -0.431005 -0.451191 0.014016 0.287129 0.417867 0.410564 -0.709185 -0.706452 -0.704467 -0.376426 -0.379412 -0.411512 -0.393988 -0.248202 -0.224029 -0.227557 -0.260284 -0.245045 -0.246273 0.249037 0.263570 0.205070 0.206861 0.267145 0.212623 0.223414 0.213287 0.228222 0.223546 0.211529 0.228889 0.211133 0.222628 0.378238 0.227507 0.278279 0.286820 0.217004 0.220686 0.222173 0.221406 0.221255 0.224460 0.225128
chargesum: 0.00000
title: Mulliken charges with hydrogens summed into heavy atoms:
elementType: O N C C C C C C C C C C C C C C C C C C C C
charge: -0.127925 -0.229753 -0.019506 0.037635 0.022815 0.014016 0.287129 0.417867 0.410564 -0.059860 -0.043155 -0.041817 -0.148920 -0.101132 -0.124692 -0.176984 -0.027516 -0.001856 -0.006151 -0.039030 -0.020585 -0.021145
polarizability: 2.23676673e+02 4.37601098e+00 2.36716928e+02 8.56314016e+00 8.42932926e+00 1.93340444e+02
1716.lowfreq: -5.6432 -0.0007 -0.0003 0.0005 3.2231 9.3242 25.3616 33.8178 35.0066
frequency: 25.3419 33.7668 34.9819 43.1239 57.8908 66.5606 124.6511 155.3199 160.6892 193.2943 203.4795 205.7943 244.0120 248.0807 262.2816 275.9361 290.0305 326.5901 337.3893 342.9617 364.5688 374.0058 385.3089 400.9276 403.6248 453.3264 469.2948 491.2813 502.7013 514.8450 573.6666 615.7154 616.6038 624.8452 634.0829 691.3368 702.1258 707.3684 755.2763 769.3039 789.5707 849.9332 854.4295 861.3189 872.6260 882.8660 894.7677 905.4968 907.8411 922.7059 923.8796 940.0111 942.4304 971.0835 975.8615 979.6454 988.7511 989.5056 991.0107 995.3849 1000.4088 1006.9327 1017.6399 1023.4962 1029.4522 1034.2510 1051.9628 1074.0158 1077.4966 1087.0058 1106.3112 1135.3852 1159.3052 1167.6822 1170.2179 1172.8280 1182.6240 1186.6205 1196.6023 1205.3141 1228.1810 1235.8788 1246.2472 1262.7599 1283.0906 1304.9393 1307.1548 1317.7189 1373.8133 1375.4801 1377.1382 1380.9724 1400.4567 1429.4079 1432.9185 1454.9719 1462.3504 1467.6442 1470.6138 1473.3147 1476.9112 1478.0413 1484.1776 1487.7255 1496.2140 1508.9611 1587.8187 1591.1080 1606.3525 1611.1260 2865.5697 2962.7536 2972.3204 2979.0668 2979.8061 2985.3864 3068.9733 3070.7192 3072.6480 3075.4565 3077.0131 3081.0259 3086.7493 3092.6658 3093.3593 3115.8632 3116.5646 3124.6835 3126.3638 3137.5878 3138.5227 3154.9393 3155.6192 3169.2471 3172.0921
redmass: 3.5455 3.9867 4.0014 3.0849 4.5597 3.9778 3.3019 2.6874 3.5218 1.1733 3.4985 4.0615 3.5007 1.0963 1.0876 4.6256 2.7893 3.6674 3.7206 3.7006 2.4142 2.5681 2.9453 2.8317 2.8794 4.3122 2.7722 2.8169 3.6495 3.2248 3.1303 6.3924 6.3368 3.5730 5.6834 4.9346 1.8329 1.6978 1.8126 2.0252 2.8124 1.2361 1.2246 1.1411 4.1938 1.7749 2.7875 2.1069 1.7489 1.5498 1.5846 1.9247 1.2162 2.4641 1.5152 1.3898 2.5441 5.7012 5.5342 1.3443 1.5529 1.9592 1.4930 2.2677 2.1143 1.8856 2.0445 1.5677 1.6091 1.0402 2.8230 2.0609 1.5070 1.1331 1.0751 1.7486 1.3114 1.3967 1.3742 3.4237 2.9583 3.0467 1.5474 2.4151 1.5599 1.3643 1.4694 1.3533 1.2105 1.2189 8.2251 8.6584 1.2102 2.1940 2.2188 1.0515 1.0502 1.0490 1.0830 2.0800 1.3005 1.5477 1.0576 1.1264 1.0757 1.1897 6.1753 6.1517 6.1476 6.0826 1.0718 1.0623 1.0575 1.0397 1.0351 1.0383 1.0998 1.1014 1.1003 1.0995 1.0989 1.0985 1.1006 1.0926 1.0957 1.0844 1.0843 1.0878 1.0877 1.0937 1.0936 1.0979 1.0980 1.0960 1.0964
irintensity: 0.0963 0.3077 0.3685 0.0906 0.0463 0.7156 0.9077 0.5459 0.8068 0.0746 1.6862 0.6480 2.0329 0.2327 0.0695 2.3962 5.1925 3.0727 3.4479 4.5111 2.6133 6.7884 1.8461 0.0617 0.1302 2.9778 0.0637 2.9823 11.8390 17.6289 3.0283 0.1460 0.2519 11.8068 21.0606 1.2308 32.5575 78.2251 34.5385 46.3108 3.5351 2.6522 5.6403 33.5771 4.7762 4.5525 9.0189 5.8506 2.7748 0.9447 1.5663 5.9430 0.1468 26.3661 6.1233 0.5818 6.9092 0.5287 1.5411 2.6527 10.2154 9.0494 3.6405 8.7777 2.5724 5.2192 4.6373 13.5674 4.4522 2.0938 0.3261 0.4795 19.5958 10.5762 2.5027 20.8637 10.6616 1.6883 0.8846 8.8710 41.1802 124.6273 11.9356 6.5886 6.6593 1.1621 1.5384 1.4056 35.9382 27.5939 0.1391 1.8788 17.5674 2.8777 11.6394 1.0761 0.9970 0.1118 1.1419 28.3362 29.8820 10.5779 14.8680 10.4134 12.8192 118.2826 0.1901 0.7681 11.2577 1.9102 1010.5872 39.5566 11.5250 43.2314 33.3964 6.2616 16.8451 21.3507 2.0507 1.7148 51.9298 75.3324 1.3994 54.1982 40.5153 8.0830 1.8928 5.1865 5.9921 23.4335 55.1159 29.8382 29.3539 15.1485 9.1956
temp: 298.150 k
press: 1.00000 atm
elementType: 8 7 6 6 6 6 6 6 6 6 6 6 6 6 6 6 6 6 6 6 6 6 1 1 1 1 1 1 1 1 1 1 1 1 1 1 1 1 1 1 1 1 1 1 1 1 1
symmnumber: 1
zpe: 1044911.4 jmol-1
zpe.correction: 0.397986 hartree
zpe.thermalcorrener: 0.418836 hartree
zpe.thermalcorrenthalpy: 0.419780 hartree
zpe.thermalcorrgfe: 0.347693 hartree
zpe.sumelectzpe: -905.437602 hartree
zpe.sumelectthermal: -905.416752 hartree
zpe.sumelectthermalent: -905.415807 hartree
zpe.sumelectthermalfe: -905.487894 hartree
dipole: 2.9505 -0.1197 -2.4202
dipole: 3.8180
quadrupole: -123.4791 -127.9102 -127.5919
quadrupole: 1.1197 1.4104 1.9766
quadrupole: 2.8479 -1.5831 -1.2648 1.1197 1.4104 1.9766
hfenergy: -905.8355873 hartree
pointgroup: C01[X(C20H25N1O1)]
dipole: 1.1837798 0.0106359 0.9246216 debye
polarizability: 223.1192153|-3.7818882|236.5108661|-9.2082935|9.4771518|194.1039637 unknown
InChI: InChI=1S/C20H25NO/c1-19(2,3)21-14-18(15-21)20(22,16-10-6-4-7-11-16)17-12-8-5-9-13-17/h4-13,18,22H,14-15H2,1-3H3
charge 0 multiplicity 1
47 atoms
O  0.294311 0.019523 -1.412772
N  2.565909 0.017911 -0.003101
C  0.700821 -0.025354 1.016692
C  1.815172 1.057474 0.813374
C  1.809879 -1.088149 0.715235
C  -0.384932 0.02394 -0.107462
C  4.059137 0.018526 -0.136664
C  -1.281764 -1.237558 -0.010847
C  -1.248796 1.304519 -0.013201
C  4.788622 -0.045814 1.2359
C  4.43759 -1.215919 -0.990375
C  4.447958 1.321231 -0.876313
C  -2.116169 -1.458196 1.115168
C  -1.78907 1.843054 -1.208562
C  -1.264372 -2.201333 -1.047064
C  -1.548871 1.945628 1.215432
C  -2.903526 -2.626522 1.209855
C  -2.61496 2.986737 -1.176474
C  -2.055999 -3.369334 -0.956083
C  -2.371664 3.095583 1.249392
C  -2.875255 -3.590126 0.174087
C  -2.912452 3.618984 0.054178
H  0.245491 -0.085522 2.01465
H  1.540641 1.969313 0.25817
H  2.317934 1.325516 1.765513
H  2.309233 -1.439753 1.641142
H  1.531328 -1.946245 0.082286
H  4.538785 0.823601 1.871512
H  5.882468 -0.040185 1.079964
H  4.536248 -0.96855 1.790129
H  3.926434 -1.179361 -1.96868
H  4.149153 -2.156002 -0.484667
H  5.528442 -1.244914 -1.16254
H  3.933713 1.378519 -1.851883
H  5.538554 1.355008 -1.049347
H  4.170413 2.213948 -0.285912
H  1.303964 0.062736 -1.223565
H  -2.172992 -0.708886 1.913599
H  -1.531048 1.360365 -2.155551
H  -0.632414 -2.005113 -1.918011
H  -1.136025 1.567874 2.158101
H  -3.544477 -2.781306 2.085592
H  -3.024748 3.387915 -2.110771
H  -2.035188 -4.1046 -1.769121
H  -2.587196 3.58098 2.208432
H  -3.489643 -4.495014 0.245168
H  -3.552138 4.50857 0.079592
