program: Gaussian 09
title: 000026716
version: EM64L-G09RevD.01
frameworkgroup: C1[X(C4H6Cl4)]
method: RPBEPBE
basis: SDD
operation: Freq
keyword: #pfreq=noraman
keyword: PBEPBE/SDD
title: #p freq=noraman PBEPBE/SDD
converged: NO NO NO NO
title: Mulliken charges:
elementType: Cl Cl Cl Cl C C C C H H H H H H
charge: 0.039629 0.039629 0.039631 0.039628 -0.286605 -0.286605 -0.555445 -0.555445 0.251194 0.251194 0.260405 0.260404 0.251194 0.251193
chargesum: 0.00000
title: Mulliken charges with hydrogens summed into heavy atoms:
elementType: Cl Cl Cl Cl C C C C
charge: 0.039629 0.039629 0.039631 0.039628 -0.286605 -0.286605 0.207347 0.207347
polarizability: 7.83604542e+01 4.17642901e-05 9.70235239e+01 -6.26647331e+00 -3.48627546e-05 6.85178513e+01
1716.lowfreq: -7.1925 -0.0005 0.0027 0.0031 12.1327 14.0393 80.1261 155.2670 203.4992
frequency: 80.1261 155.2670 203.4987 216.0323 228.0610 267.2508 268.5159 276.2195 276.7351 322.4176 337.3336 350.2018 395.0177 527.6063 587.8851 614.2863 670.7889 819.9826 1030.6414 1077.5203 1077.6437 1098.7276 1112.9947 1195.0701 1393.5719 1394.3081 1454.1001 1454.5364 1455.3780 1457.7290 3013.0770 3013.5611 3118.5348 3118.7715 3130.5387 3131.3503
redmass: 8.9107 29.0346 33.3130 4.4192 2.3655 1.0506 11.4631 4.2810 1.4762 3.0493 4.6474 7.9766 4.3605 4.7381 5.1395 5.4949 4.2807 2.6474 2.8090 1.5406 1.4882 2.1393 2.4745 4.4352 1.1908 1.1955 1.0416 1.0420 1.0416 1.0461 1.0347 1.0346 1.1004 1.1005 1.1009 1.1005
irintensity: 0.9897 0.6313 0.0000 6.6781 0.0000 0.1201 3.7769 0.0000 0.0000 3.4888 0.0000 0.0000 11.2241 0.0000 58.1448 156.1554 0.0000 0.0000 61.1949 0.0431 85.4827 41.6616 0.0000 0.0000 62.2080 0.0010 21.5977 0.0003 22.8590 0.0000 3.7203 0.0015 0.0041 5.3363 0.0032 6.7156
temp: 298.150 k
press: 1.00000 atm
elementType: 17 17 17 17 6 6 6 6 1 1 1 1 1 1
symmnumber: 1
zpe: 241198.7 jmol-1
zpe.correction: 0.091868 hartree
zpe.thermalcorrener: 0.101899 hartree
zpe.thermalcorrenthalpy: 0.102843 hartree
zpe.thermalcorrgfe: 0.056203 hartree
zpe.sumelectzpe: -1995.622008 hartree
zpe.sumelectthermal: -1995.611977 hartree
zpe.sumelectthermalent: -1995.611033 hartree
zpe.sumelectthermalfe: -1995.657672 hartree
dipole: 0.0000 0.0000 0.0000
dipole: 0.0000
quadrupole: -80.1258 -78.4792 -69.1531
quadrupole: 0.0000 2.8415 0.0000
quadrupole: -4.2064 -2.5598 6.7663 0.0000 2.8415 0.0000
hfenergy: -1995.7138756 hartree
pointgroup: C01 [X(C4H6Cl4)]
dipole: 0.0000006 0.0000188 -0.0000014 debye
dipolederiv: -0.301681 -0.2048017 -0.0914468 -0.1527507 -0.5243975 -0.1856988 -0.0652784 -0.2032734 -0.2756218 -0.3016976 0.2048238 -0.0914332 0.1527677 -0.5244247 0.1856684 -0.0652716 0.2032452 -0.2755801 -0.3016812 -0.2048032 -0.0914503 -0.1527503 -0.5243904 -0.1857018 -0.0652816 -0.2032774 -0.2756259 -0.3016968 0.2048221 -0.0914303 0.1527679 -0.5244302 0.1856653 -0.0652686 0.2032412 -0.2755762 0.5998676 -0.0000253 0.1846732 -0.0000188 1.0431235 0.000028 0.1327421 0.0000288 0.5618324 0.5998699 -0.0000157 0.1846727 -0.0000157 1.0431225 0.0000375 0.1327398 0.0000339 0.5618358 -0.1558227 -0.0000017 0.0356118 -0.000004 -0.1278262 0.0000065 0.0612781 0.0000069 -0.2171483 -0.1558217 -0.0000039 0.035612 -0.0000051 -0.1278271 0.0000057 0.0612801 0.0000048 -0.217151 0.1133676 0.0652902 -0.0313315 0.047392 0.0038908 0.058189 -0.0343562 0.0470645 0.0544666 0.1133727 -0.0652824 -0.0313362 -0.0473833 0.0038966 -0.0581965 -0.0343588 -0.0470723 0.0544544 -0.0674077 -0.0000057 0.0252631 -0.0000046 0.125737 0.0000021 0.0052451 0.0000016 0.0975965 -0.0674107 -0.0000043 0.0252644 -0.000003 0.1257371 0.0000021 0.0052459 0.0000022 0.0975963 0.113369 0.06529 -0.0313308 0.0473915 0.0038894 0.058188 -0.0343552 0.0470647 0.0544671 0.1133728 -0.0652822 -0.0313381 -0.0473835 0.0038991 -0.0581954 -0.0343606 -0.0470707 0.054454 unknown
polarizability: 74.4752647|-0.0009536|97.0235238|7.9002764|0.0015653|72.4030409 unknown
InChI: InChI=1S/C4H6Cl4/c1-3(5,6)4(2,7)8/h1-2H3
charge 0 multiplicity 1
14 atoms
Cl -1.530123 -1.517157 -0.679899
Cl -1.530193 1.517157 -0.679738
Cl 1.53022 1.517138 0.679934
Cl 1.530274 -1.517175 0.679735
C  -0.766952 -0.000026 0.160032
C  0.76704 0.000027 -0.160017
C  -1.172398 -0.000117 1.628688
C  1.172479 0.000126 -1.628673
H  -0.772887 -0.899788 2.125515
H  -0.77293 0.899517 2.125614
H  -2.270623 -0.000147 1.705285
H  2.270708 0.000144 -1.705276
H  0.772983 0.899806 -2.125496
H  0.773003 -0.899506 -2.125603
