program: Gaussian 09
title: 000296724
version: EM64L-G09RevD.01
frameworkgroup: C1[X(C18H15Cl)]
method: RPBEPBE
basis: SDD
operation: Freq
keyword: #p
keyword: freq=noraman
keyword: PBEPBE/SDD
title: #p freq=noraman PBEPBE/SDD
converged: YES YES NO NO
title: Mulliken charges:
elementType: Cl C C C C C C C C C C C C C C C C C C H H H H H H H H H H H H H H H
charge: -0.061925 -0.221168 -0.379339 -0.530523 -0.269628 0.366953 -0.498665 0.518365 0.327076 -0.437256 -0.380617 -0.368580 -0.377214 -0.229918 -0.250999 -0.224636 -0.229723 -0.243751 -0.106397 0.247997 0.256315 0.245414 0.239830 0.213866 0.250955 0.228881 0.240298 0.237368 0.254606 0.223571 0.224165 0.253690 0.253025 0.227963
chargesum: 0.00000
title: Mulliken charges with hydrogens summed into heavy atoms:
elementType: Cl C C C C C C C C C C C C C C C C C C
charge: -0.061925 0.026829 -0.123024 -0.045278 -0.055762 0.366953 -0.247710 0.518365 0.327076 -0.208375 -0.140319 -0.131212 -0.122608 -0.006347 -0.026834 0.029054 0.023302 -0.015788 -0.106397
polarizability: 3.26372118e+02 1.07508495e+00 1.54807562e+02 -1.70292781e+01 2.70649340e+00 1.37552011e+02
1716.lowfreq: -3.9394 -0.0011 0.0018 0.0020 5.4392 10.7238 28.5810 35.8677 42.0013
frequency: 28.5760 35.8581 41.9977 77.6175 87.3491 106.4016 174.4275 213.9684 236.2141 244.1002 279.7984 318.4257 341.8452 383.3936 405.4887 408.8949 419.7540 478.7372 487.8458 531.7206 609.8765 617.6368 622.5705 633.9198 683.3097 705.4674 709.6928 719.5269 745.8331 781.9117 793.4649 813.0916 822.9625 827.5168 838.4571 854.2861 864.4878 909.9240 928.5226 953.3014 957.7992 966.1325 974.8164 981.3131 990.5679 994.5528 999.8935 1021.5973 1028.0470 1037.3723 1049.7004 1072.7463 1074.8025 1080.1553 1090.2312 1109.4111 1171.4994 1178.4226 1186.8418 1187.9633 1201.1310 1228.7075 1239.9267 1254.6775 1282.5837 1295.9667 1322.8843 1331.6152 1351.9769 1372.2932 1381.0729 1402.0382 1439.8796 1449.4106 1479.6970 1482.5548 1572.6759 1590.6207 1598.4496 1612.7867 1619.2966 2940.1864 3093.5999 3111.0834 3119.2988 3132.3869 3135.9764 3142.2921 3142.8716 3145.7657 3149.7758 3155.3136 3161.3265 3169.6207 3173.3765 3199.3085
redmass: 5.6107 4.5672 3.9634 5.8891 4.4523 4.9521 4.8809 7.8654 4.1247 6.2665 3.6637 4.7592 5.4691 2.9666 2.8375 2.9464 4.3595 6.1710 3.1762 3.0434 4.3906 5.6097 6.1404 4.7284 4.5714 2.1190 2.2898 3.3893 1.9848 2.0683 2.8509 2.1904 2.1120 1.3173 1.8995 1.2724 1.8686 1.6643 1.9526 1.6254 2.2804 1.4204 1.6008 2.0291 5.2394 1.4163 3.2222 1.8707 1.9235 1.7346 1.1893 1.9838 1.7301 1.4175 1.5196 1.3680 1.0538 1.5247 1.1135 1.1268 2.0879 1.5693 1.5719 1.8244 2.1585 1.2698 1.7998 1.3891 3.1123 5.9087 7.6707 3.4612 2.1932 1.1870 2.4883 2.3569 7.3117 6.1392 6.2464 6.1923 7.6349 1.0820 1.0556 1.0874 1.0859 1.0909 1.0903 1.0905 1.0948 1.0887 1.0929 1.0968 1.1014 1.0958 1.0969 1.1150
irintensity: 0.0194 0.0056 0.0094 0.0211 0.2232 0.4822 1.0306 0.7761 0.7791 1.3905 0.6963 0.6648 3.3156 2.3960 0.1007 0.3020 2.2022 18.0454 14.6439 12.3614 6.4385 2.0618 4.1954 3.4353 5.9421 42.4058 11.7918 4.9141 33.5865 27.4987 13.4276 35.9402 3.5054 5.1053 64.5621 0.1577 10.0533 1.2504 4.4602 0.5666 2.5941 0.2789 4.9350 13.2314 0.3612 3.0886 28.4470 2.2187 5.9436 14.2354 13.5065 27.9757 15.6478 5.8437 20.6557 8.7433 0.0446 2.8606 1.7897 0.3182 6.5758 5.7045 2.4429 16.8450 0.4189 1.5002 5.9130 2.8282 1.7650 12.3292 1.7032 11.3369 8.2242 8.3319 103.4332 8.8247 0.7075 1.6787 8.1387 17.9279 2.6463 26.2056 15.5638 9.3521 4.6747 13.0145 9.4449 1.4602 48.6061 5.9592 20.2250 9.6258 28.7383 9.3678 1.1542 16.8664
temp: 298.150 k
press: 1.00000 atm
elementType: 17 6 6 6 6 6 6 6 6 6 6 6 6 6 6 6 6 6 6 1 1 1 1 1 1 1 1 1 1 1 1 1 1 1
symmnumber: 1
zpe: 708036.5 jmol-1
zpe.correction: 0.269677 hartree
zpe.thermalcorrener: 0.285261 hartree
zpe.thermalcorrenthalpy: 0.286205 hartree
zpe.thermalcorrgfe: 0.224759 hartree
zpe.sumelectzpe: -1153.617179 hartree
zpe.sumelectthermal: -1153.601595 hartree
zpe.sumelectthermalent: -1153.600651 hartree
zpe.sumelectthermalfe: -1153.662097 hartree
dipole: 2.3607 1.0120 -0.2507
dipole: 2.5806
quadrupole: -127.0422 -110.9777 -115.2725
quadrupole: -1.7856 -1.6620 1.2021
quadrupole: -9.2781 6.7864 2.4916 -1.7856 -1.6620 1.2021
hfenergy: -1153.8868556 hartree
pointgroup: C01 [X(C18H15Cl1)]
dipole: -0.9186414 -0.4275666 -0.064144 debye
polarizability: 325.9112911|6.8189811|154.3109855|18.2018094|-3.9455332|138.5094153 unknown
InChI: InChI=1S/C18H15Cl/c19-14-8-6-13(7-9-14)16-10-15(17-11-18(16)17)12-4-2-1-3-5-12/h1-10,15,17-18H,11H2
charge 0 multiplicity 1
34 atoms
Cl 6.578353 1.054662 0.224902
C  -1.317616 -1.95952 -0.07245
C  0.197224 -1.944069 0.23153
C  -0.838775 -1.808704 1.374135
C  -1.643314 -0.685739 -0.89826
C  0.709448 -0.637686 -0.327614
C  -0.318476 0.071983 -0.893569
C  -2.859497 0.094614 -0.39487
C  2.122573 -0.223875 -0.207439
C  -4.151726 -0.218003 -0.889969
C  -2.741279 1.108665 0.590888
C  2.669192 0.818617 -1.010453
C  2.984062 -0.870352 0.723104
C  -5.297538 0.451288 -0.406531
C  -3.884448 1.784188 1.074089
C  4.014714 1.215266 -0.881942
C  4.33528 -0.487986 0.86422
C  -5.168018 1.456039 0.580634
C  4.830966 0.553601 0.05836
H  -1.828022 -2.887309 -0.343174
H  0.813848 -2.84552 0.169745
H  -0.982622 -2.672614 2.030734
H  -0.928846 -0.837272 1.86943
H  -1.866678 -1.004815 -1.94015
H  -0.243904 1.08785 -1.295727
H  -4.259613 -0.991854 -1.661053
H  -1.748265 1.37852 0.969693
H  2.040236 1.313633 -1.757949
H  2.587442 -1.669616 1.357633
H  -6.287316 0.194857 -0.801331
H  -3.77399 2.568012 1.832362
H  4.42571 2.014401 -1.505534
H  4.987112 -0.987664 1.58649
H  -6.054616 1.980503 0.95427
