program: Gaussian 09
title: 000296759
version: EM64L-G09RevD.01
frameworkgroup: C1[X(C24H25NO)]
method: RPBEPBE
basis: SDD
operation: Freq
keyword: #p
keyword: freq=noraman
keyword: PBEPBE/SDD
title: #p freq=noraman PBEPBE/SDD
converged: YES YES NO NO
title: Mulliken charges:
elementType: O N C C C C C C C C C C C C C C C C C C C C C C C C H H H H H H H H H H H H H H H H H H H H H H H H H
charge: -0.217341 -0.141461 -0.309477 -0.308243 -0.461625 0.279765 0.515650 0.061841 -0.706139 -0.697974 -0.720856 0.340952 -0.415407 -0.399194 -0.236172 -0.235976 -0.521433 -0.395003 -0.248815 0.356142 -0.428913 0.370752 -0.417179 -0.406993 -0.247428 -0.236933 0.212017 0.276195 0.221300 0.234464 0.208345 0.216108 0.224080 0.225319 0.223864 0.202304 0.224679 0.208818 0.223758 0.239299 0.270125 0.227515 0.225029 0.262607 0.279899 0.228558 0.239826 0.249863 0.241416 0.231543 0.230530
chargesum: 0.00000
title: Mulliken charges with hydrogens summed into heavy atoms:
elementType: O N C C C C C C C C C C C C C C C C C C C C C C C C
charge: -0.217341 -0.141461 -0.097460 -0.032048 -0.005861 0.279765 0.515650 0.061841 -0.057605 -0.046487 -0.063602 0.340952 -0.176108 -0.129068 -0.008657 -0.010947 -0.258826 -0.115104 -0.020258 0.356142 -0.189087 0.370752 -0.167316 -0.165577 -0.015886 -0.006403
polarizability: 3.54640975e+02 4.21741880e+01 2.95961212e+02 2.33413771e+01 -1.79057705e+01 1.72750994e+02
1716.lowfreq: -9.7144 -4.8678 -0.0005 -0.0004 0.0002 5.5797 16.0330 19.5696 31.9191
frequency: 15.2929 19.0772 31.8137 38.6155 44.7170 56.8791 83.6393 86.7866 114.3850 158.1790 176.8354 185.1320 191.9418 220.0223 228.4486 231.6942 243.7286 259.3510 268.5544 307.0522 321.5537 334.5723 349.3915 366.5446 380.1895 393.7229 405.1287 446.9337 466.1893 478.8371 486.5589 493.5994 511.5046 527.9054 562.8392 595.7543 614.6698 616.7437 629.5427 640.4646 698.9619 709.1663 717.0946 760.5405 762.5021 773.7296 785.3455 790.8519 815.0527 837.7471 847.2619 862.0795 883.0854 886.2516 899.4940 917.0638 920.1490 929.2657 932.2806 937.8096 948.5882 960.2427 970.1936 985.0702 990.1795 994.2423 1000.4323 1002.7036 1003.7842 1011.0237 1020.2898 1023.8920 1025.6921 1065.6175 1068.9961 1087.7144 1088.7351 1123.8430 1136.1813 1153.0581 1169.0091 1172.2740 1174.2771 1181.1141 1210.5988 1214.0799 1216.9029 1225.7155 1234.8977 1236.5692 1254.5717 1260.6650 1283.8665 1284.4386 1297.4912 1337.4099 1345.9693 1356.4259 1368.6471 1371.9282 1386.5347 1395.7084 1412.5171 1426.0158 1435.7981 1440.7623 1452.2524 1460.5352 1463.9631 1465.4781 1474.0981 1479.1676 1480.2081 1490.8308 1494.5124 1507.5929 1561.6611 1584.5311 1590.6988 1602.5025 1610.7818 1636.3029 2923.9305 2975.9066 2977.3913 2978.8394 2983.8460 3046.2031 3067.5663 3069.6310 3072.1448 3075.8955 3079.7465 3084.8840 3090.8324 3112.9589 3122.3130 3122.5171 3127.3618 3128.8775 3135.0177 3143.0809 3144.3560 3145.6607 3160.8833 3163.0150 3163.9049
redmass: 5.5030 4.7059 3.9571 2.6742 4.0155 4.2585 6.9664 5.0323 4.2842 2.3499 1.5176 2.9830 3.7166 2.4127 4.4594 1.0847 2.3577 1.4899 2.8557 3.5651 3.8470 3.5452 3.4443 2.9820 3.0108 3.0666 2.8547 3.8360 3.0064 2.4956 3.3750 3.8378 6.7807 3.3373 3.4974 5.9584 5.7539 4.7905 6.2162 4.2244 3.6830 1.7409 2.7875 4.7689 1.4852 2.0102 3.1082 2.6759 3.7060 2.7807 1.3571 1.2499 2.8014 2.2110 1.6918 1.6401 1.9099 1.6090 3.8395 1.2378 2.5512 3.2252 1.4386 1.4277 5.1445 1.3454 1.3452 1.6920 1.3759 1.4717 2.2419 2.1997 2.1300 2.3334 2.1126 2.5352 1.8596 1.6763 1.4255 1.2118 1.1261 1.2161 1.1040 1.1200 1.6318 2.1478 1.9120 1.4939 2.7981 2.1832 2.5710 1.8255 1.7791 1.6625 1.5944 1.6978 1.6432 1.8981 1.2289 1.2253 5.2383 1.2125 5.0943 3.0532 4.2701 2.0873 1.0597 1.0504 2.4506 1.0498 1.0606 1.1300 2.0415 1.0854 1.0840 3.6127 7.8906 7.5371 6.0576 5.5984 6.0856 6.6358 1.0817 1.0458 1.0363 1.0441 1.0381 1.1008 1.0904 1.0997 1.0995 1.0992 1.0986 1.1001 1.0994 1.0872 1.0859 1.0861 1.0896 1.0887 1.0910 1.0914 1.0947 1.0957 1.1013 1.0997 1.0961
irintensity: 0.5809 0.6148 0.1208 0.0644 0.3061 0.7089 0.9061 0.1970 0.3540 1.1414 0.3670 1.8203 1.7406 2.2753 1.6615 0.0248 0.1666 0.9252 0.0908 3.7612 1.4232 0.4828 3.1005 8.5390 5.7688 0.1793 0.1318 0.9869 3.3736 21.7914 6.9780 0.4805 0.1100 5.1547 1.3670 14.1197 0.9366 1.6929 3.4884 3.6994 1.2445 62.0486 9.5669 0.1676 26.0136 61.0086 5.1373 1.6899 20.7860 9.7228 17.1354 0.2704 16.6430 26.3130 2.7801 4.4249 15.8529 4.6640 15.6660 0.2948 12.2165 10.7017 8.4256 0.0726 0.0899 0.0919 1.4800 6.8289 0.3220 0.9600 15.5252 12.0271 10.2986 9.5826 11.2761 7.8843 1.3294 35.2607 16.8441 6.7742 1.9129 12.1478 1.6072 5.4339 186.9837 4.1909 33.8521 7.9446 75.0171 22.1356 15.8872 19.1975 58.3669 4.5429 12.6467 27.3504 4.9990 60.3264 30.6355 22.4465 2.4621 25.1688 12.4274 0.7141 2.0818 9.4897 2.7829 0.8224 31.5777 1.8780 9.4330 1.5238 14.7217 6.8673 36.3491 1.5841 136.5200 34.0290 0.6619 7.8318 3.3529 18.0583 31.8977 19.5252 19.4882 58.4570 26.1449 24.3283 25.3504 1.3002 7.4297 55.5073 81.6493 13.1341 66.2891 6.3030 2.2299 0.3924 2.2525 9.4261 12.0593 1.1171 33.9093 25.1984 25.0756 28.8987 17.4223
temp: 298.150 k
press: 1.00000 atm
elementType: 8 7 6 6 6 6 6 6 6 6 6 6 6 6 6 6 6 6 6 6 6 6 6 6 6 6 1 1 1 1 1 1 1 1 1 1 1 1 1 1 1 1 1 1 1 1 1 1 1 1 1
symmnumber: 1
zpe: 1106887.1 jmol-1
zpe.correction: 0.421591 hartree
zpe.thermalcorrener: 0.445145 hartree
zpe.thermalcorrenthalpy: 0.446089 hartree
zpe.thermalcorrgfe: 0.366547 hartree
zpe.sumelectzpe: -1057.660236 hartree
zpe.sumelectthermal: -1057.636682 hartree
zpe.sumelectthermalent: -1057.635738 hartree
zpe.sumelectthermalfe: -1057.715281 hartree
dipole: 1.6860 2.5598 -0.0104
dipole: 3.0652
quadrupole: -135.7778 -154.5121 -153.4562
quadrupole: 1.9450 3.6141 -2.5907
quadrupole: 12.1376 -6.5967 -5.5409 1.9450 3.6141 -2.5907
hfenergy: -1058.0818272 hartree
pointgroup: C01 [X(C24H25N1O1)]
dipole: -0.6386594 -1.0178112 -0.1022274 debye
polarizability: 353.5431884|44.6199163|294.1717755|-16.1501861|28.3921606|175.6382172 unknown
InChI: InChI=1S/C24H25NO/c1-24(2,3)25-16-21(22(25)18-10-5-4-6-11-18)23(26)20-14-13-17-9-7-8-12-19(17)15-20/h4-15,21-22H,16H2,1-3H3
charge 0 multiplicity 1
51 atoms
O  0.522779 3.219988 0.429252
N  3.194292 0.51582 -0.358174
C  1.879093 0.127736 0.267665
C  1.176806 1.183269 -0.712753
C  2.596934 1.762835 -0.965733
C  4.450178 0.591933 0.45978
C  1.453942 -1.321913 0.152668
C  0.155836 2.109511 -0.068506
C  4.323019 1.522023 1.705205
C  4.803859 -0.84351 0.919834
C  5.557136 1.129795 -0.479749
C  -1.280163 1.683944 0.00385
C  0.627843 -1.910911 1.143378
C  1.834744 -2.096042 -0.972964
C  0.180979 -3.245211 1.009217
C  1.393091 -3.429888 -1.108231
C  -1.713464 0.410351 -0.399849
C  -2.237893 2.619038 0.534822
C  0.561578 -4.009047 -0.118583
C  -3.08695 0.025482 -0.284388
C  -3.580831 2.276256 0.642313
C  -4.046038 0.976922 0.240822
C  -3.53899 -1.279666 -0.673761
C  -5.420827 0.589495 0.346558
C  -4.885799 -1.630584 -0.556527
C  -5.833914 -0.687731 -0.044402
H  1.76398 0.475568 1.319572
H  0.765951 0.665455 -1.593645
H  2.884774 1.93718 -2.016445
H  2.745188 2.689439 -0.375949
H  3.586403 1.131893 2.431474
H  5.296013 1.591535 2.22503
H  4.017979 2.545758 1.421941
H  4.919516 -1.509481 0.046979
H  4.013725 -1.266131 1.56699
H  5.748505 -0.83993 1.493856
H  5.333505 2.159142 -0.816239
H  6.530425 1.148871 0.0431
H  5.646296 0.484595 -1.37172
H  0.329627 -1.32056 2.019407
H  2.497224 -1.636716 -1.715721
H  -0.456878 -3.687943 1.782619
H  1.698964 -4.021636 -1.978824
H  -1.004165 -0.323449 -0.797869
H  -1.867862 3.600389 0.847769
H  0.221531 -5.045843 -0.221766
H  -4.305148 2.996901 1.040273
H  -2.807415 -1.999591 -1.060093
H  -6.146866 1.309943 0.741758
H  -5.223674 -2.62877 -0.855083
H  -6.887838 -0.974713 0.04114
