program: Gaussian 09
title: 000296743
version: EM64L-G09RevD.01
frameworkgroup: C1[X(C22H32N2)]
method: RPBEPBE
basis: SDD
operation: Freq
keyword: #pfreq=noraman
keyword: PBEPBE/SDD
title: #p freq=noraman PBEPBE/SDD
converged: NO YES NO NO
title: Mulliken charges:
elementType: N N C C C C C C C C C C C C C C C C C C C C C C H H H H H H H H H H H H H H H H H H H H H H H H H H H H H H H H
charge: -0.349745 -0.351665 -0.322377 -0.319975 0.261598 0.261692 0.516999 0.514912 -0.679813 -0.700828 -0.730966 -0.679332 -0.699063 -0.731878 -0.390513 -0.391254 -0.455770 -0.455398 -0.254846 -0.255043 -0.238604 -0.239124 -0.249385 -0.249370 0.237853 0.237233 0.272852 0.273192 0.232765 0.201357 0.209098 0.225325 0.209058 0.210193 0.203053 0.208125 0.228441 0.231742 0.201437 0.209949 0.225125 0.208704 0.209766 0.203188 0.208558 0.228551 0.230991 0.229789 0.252188 0.254051 0.224866 0.224843 0.222942 0.223013 0.225726 0.225774
chargesum: 0.00000
title: Mulliken charges with hydrogens summed into heavy atoms:
elementType: N N C C C C C C C C C C C C C C C C C C C C C C
charge: -0.076893 -0.078473 -0.084524 -0.082743 0.261598 0.261692 0.516999 0.514912 -0.036593 -0.056253 -0.091348 -0.036203 -0.055468 -0.091580 -0.159522 -0.161465 -0.203582 -0.201347 -0.029980 -0.030200 -0.015662 -0.016111 -0.023659 -0.023595
polarizability: 2.15357743e+02 -3.55193812e+00 2.69527795e+02 -3.99211282e-01 1.44632702e-02 2.50802167e+02
1716.lowfreq: -21.4637 -15.2092 -13.2354 -9.2764 -0.0008 -0.0006 -0.0005 10.6630 20.7462
frequency: -18.7843 8.7279 20.4817 40.3553 46.6101 51.0475 58.9237 70.5857 78.2404 111.8666 161.3356 165.6364 176.1127 203.5145 205.8293 215.1797 218.5289 236.7676 241.5125 246.6166 257.7094 260.0493 272.9089 273.9012 333.3797 343.7293 368.0914 368.9577 398.5693 403.6164 405.5420 434.1667 436.2392 462.3388 466.7426 481.0322 487.0700 519.8287 538.2799 566.7334 593.6124 606.4856 616.0299 616.6011 669.5138 705.2146 706.4712 739.8544 741.9333 759.1472 765.6314 779.3687 849.5654 852.4539 853.3930 891.8241 892.2003 907.5190 910.4698 916.9726 921.3105 935.5286 936.1015 936.8242 940.0335 971.4840 973.6860 984.3225 989.6852 989.9302 992.4550 993.7696 1015.1250 1015.4246 1023.9137 1025.9261 1027.5932 1032.3446 1075.1060 1076.3522 1119.6951 1124.3504 1158.2651 1170.1861 1170.6490 1175.2885 1188.6278 1189.4668 1208.4911 1211.7637 1219.8357 1231.2268 1232.3763 1236.3650 1244.9374 1287.1435 1297.0490 1302.1373 1341.1426 1342.7064 1366.9043 1367.2135 1369.0938 1369.5065 1383.1651 1384.4722 1392.8217 1393.3945 1435.4997 1437.5242 1443.9549 1446.5097 1451.7277 1452.8794 1458.3487 1458.4577 1465.6847 1466.6817 1475.9784 1476.5918 1478.5444 1479.3631 1482.6802 1483.7960 1493.2913 1494.3270 1588.0994 1588.6885 1607.0487 1607.3065 2968.9538 2969.0005 2972.2112 2972.4053 2980.9949 2981.9442 3031.4659 3040.5241 3061.2548 3061.7095 3066.4124 3066.7156 3073.7546 3075.1731 3080.4411 3080.8232 3085.0105 3085.1619 3090.7428 3090.8830 3114.7798 3115.0264 3118.8406 3119.3827 3132.0476 3132.5737 3141.1504 3141.5698 3159.0921 3159.2724 3452.0156 3455.9656
redmass: 2.7458 2.9606 3.6592 3.7052 4.6404 3.4741 3.8589 3.7247 3.7639 2.8340 3.4789 1.3025 1.3928 2.8026 2.0995 1.9189 3.3640 1.9048 1.2674 1.2501 1.2300 1.2872 2.5478 2.5806 2.2827 2.2860 2.4980 2.4721 2.5914 2.7735 2.8038 1.6095 2.1205 2.4774 2.8862 2.9983 2.8443 2.7130 1.7373 2.8754 3.9391 4.2782 6.3170 6.3632 4.0698 1.5988 1.6287 3.3848 3.4921 3.5987 2.1279 2.4760 2.1176 1.3011 1.3759 1.7399 1.7417 1.5028 1.9649 1.7508 1.5521 1.8367 1.2446 1.2316 1.9865 1.3934 1.3922 2.6444 5.3350 5.5274 1.3572 1.4566 1.3969 1.4056 1.9428 1.8156 1.6300 1.8726 1.7681 1.7362 3.4659 3.5838 2.1531 1.1388 1.0552 2.3069 1.1259 1.1359 2.3825 2.6502 2.0656 2.6883 2.8942 1.5133 2.5084 1.4397 1.5979 1.5028 1.3122 1.3653 1.2127 1.2116 1.2388 1.2419 4.7331 4.3695 1.2402 1.2374 1.8436 1.9703 1.1765 1.1309 1.0974 1.1359 1.0509 1.0512 1.0541 1.0537 1.0919 1.1301 1.8805 2.0816 1.1201 1.1294 1.0625 1.0602 5.8774 5.8787 5.9838 5.9585 1.0358 1.0358 1.0355 1.0355 1.0357 1.0355 1.0838 1.0858 1.0985 1.0984 1.0990 1.0988 1.0980 1.0981 1.0998 1.0998 1.1000 1.0998 1.0997 1.0997 1.0846 1.0845 1.0868 1.0867 1.0914 1.0915 1.0960 1.0960 1.1014 1.1013 1.0740 1.0740
irintensity: 0.0833 0.1551 0.0210 0.7553 0.0100 0.8165 0.1976 0.1319 0.0235 2.7577 0.1476 0.1694 0.8623 0.0416 0.0805 0.3923 1.8769 0.2491 0.6119 0.3313 0.3739 0.2594 1.5578 0.1369 2.6015 1.6695 0.4686 0.2914 6.1658 2.2048 0.3942 5.3065 40.3292 0.5839 8.8156 5.7435 40.8583 0.5947 139.3913 4.0894 14.0023 94.9885 1.1821 0.0196 12.2738 86.7389 64.8709 2.0194 4.6374 0.1788 4.0267 10.5515 6.3907 1.1744 3.0572 0.6441 1.0038 0.0387 1.1440 0.1453 2.9991 12.3390 0.6210 0.2482 0.1411 0.1297 0.3544 2.2752 0.2320 0.3598 0.3493 1.5097 1.1102 2.1018 8.7181 2.2884 0.9920 1.9276 2.6347 19.8072 20.2683 57.1745 5.6908 1.5761 0.0028 6.0955 0.6353 0.0299 59.7005 0.2245 60.5585 47.0558 128.5068 11.6043 29.1124 8.8427 1.9396 10.3183 0.2785 2.3361 16.8084 27.3999 28.9738 34.5327 0.1160 3.4138 35.1509 18.3025 3.1472 5.4602 5.4067 18.7421 5.7456 25.9235 2.2141 1.4485 7.4520 0.4695 6.9835 4.8868 8.2299 17.9034 21.4005 20.7389 19.7451 7.5655 0.5939 1.4345 3.8635 2.3872 2.3943 49.3799 46.6616 23.2661 14.6298 18.8342 1.7052 26.3561 4.0028 5.0657 10.9340 76.8852 76.7877 60.4588 34.3768 20.6761 14.6202 19.1942 148.2293 1.0004 5.2632 8.1407 0.1329 0.0598 12.9162 19.9612 43.9749 38.3728 30.2667 24.2034 1.5935 1.5808
temp: 298.150 k
press: 1.00000 atm
elementType: 7 7 6 6 6 6 6 6 6 6 6 6 6 6 6 6 6 6 6 6 6 6 6 6 1 1 1 1 1 1 1 1 1 1 1 1 1 1 1 1 1 1 1 1 1 1 1 1 1 1 1 1 1 1 1 1
symmnumber: 1
zpe: 1275198.2 jmol-1
zpe.correction: 0.485697 hartree
zpe.thermalcorrener: 0.510968 hartree
zpe.thermalcorrenthalpy: 0.511912 hartree
zpe.thermalcorrgfe: 0.429605 hartree
zpe.sumelectzpe: -965.204800 hartree
zpe.sumelectthermal: -965.179530 hartree
zpe.sumelectthermalent: -965.178586 hartree
zpe.sumelectthermalfe: -965.260892 hartree
dipole: -0.0017 -0.0031 0.4940
dipole: 0.4940
quadrupole: -148.2346 -140.5648 -140.7913
quadrupole: 2.7932 -0.1232 0.0592
quadrupole: -5.0377 2.6321 2.4056 2.7932 -0.1232 0.0592
hfenergy: -965.6904972 hartree
pointgroup: C01 [X(C22H32N2)]
dipole: -0.0006525 0.0111616 0.1940382 debye
polarizability: 217.8163367|-11.8031768|267.0222921|0.8085479|-0.839907|250.8490756 unknown
InChI: InChI=1S/C22H32N2/c1-21(2,3)23-19(17-13-9-7-10-14-17)20(24-22(4,5)6)18-15-11-8-12-16-18/h7-16,19-20,23-24H,1-6H3
charge 0 multiplicity 1
56 atoms
N  -1.401447 -1.287192 -0.752344
N  1.410012 1.218849 -0.837104
C  -0.785229 0.050589 -0.694336
C  0.796995 -0.11224 -0.682405
C  -2.74707 -1.497528 -1.372257
C  2.755082 1.385997 -1.470786
C  -1.275659 0.996075 0.417926
C  1.280167 -0.970715 0.50187
C  -3.896851 -0.709143 -0.673747
C  -2.691284 -1.104695 -2.871625
C  -3.028779 -3.017409 -1.259554
C  3.902438 0.635242 -0.728383
C  2.693623 0.902888 -2.943498
C  3.043946 2.90832 -1.451343
C  -1.577499 0.533926 1.72501
C  1.599664 -0.406666 1.76391
C  -1.428658 2.381129 0.143959
C  1.405738 -2.376602 0.344248
C  -2.017995 1.426403 2.727231
C  2.030517 -1.219914 2.835262
C  -1.870536 3.278852 1.142824
C  1.837239 -3.195513 1.412971
C  -2.167642 2.803934 2.441168
C  2.152147 -2.619182 2.665354
H  -0.975126 0.551045 -1.660222
H  0.995615 -0.683193 -1.606673
H  -1.289722 -1.819601 0.119483
H  1.292655 1.815313 -0.008814
H  -3.720994 0.380024 -0.720001
H  -4.866523 -0.922387 -1.162714
H  -3.977164 -0.991239 0.392421
H  -1.850478 -1.620695 -3.368139
H  -2.562891 -0.015226 -3.007619
H  -3.632598 -1.390941 -3.375356
H  -3.046338 -3.338907 -0.199473
H  -4.009396 -3.266362 -1.703062
H  -2.244893 -3.593734 -1.782404
H  3.721437 -0.454068 -0.710855
H  4.872366 0.814961 -1.230164
H  3.985002 0.978774 0.319246
H  1.858404 1.397318 -3.470426
H  2.5511 -0.191323 -3.012838
H  3.637717 1.145462 -3.4648
H  3.067928 3.292846 -0.412681
H  4.023644 3.125913 -1.91293
H  2.260353 3.455612 -2.004903
H  -1.473719 -0.53096 1.964935
H  1.518049 0.676393 1.914779
H  -1.201538 2.751728 -0.862747
H  1.163957 -2.824994 -0.626643
H  -2.246655 1.047395 3.73013
H  2.273462 -0.762322 3.801359
H  -1.988882 4.343071 0.907434
H  1.934071 -4.277818 1.267252
H  -2.516364 3.495047 3.217016
H  2.493201 -3.249343 3.494663
