program: Gaussian 09
title: 000296689
version: EM64L-G09RevD.01
frameworkgroup: C1[X(C17H12O2)]
method: RPBEPBE
basis: SDD
operation: Freq
keyword: #pfreq=noraman
keyword: PBEPBE/SDD
title: #p freq=noraman PBEPBE/SDD
converged: YES YES NO NO
title: Mulliken charges:
elementType: O O C C C C C C C C C C C C C C C C C H H H H H H H H H H H H
charge: -0.278941 -0.209525 0.129508 0.346140 0.250996 0.321926 -0.263761 -0.325725 0.053009 -0.391115 -0.369686 -0.374055 -0.348391 -0.243250 -0.235706 -0.238585 -0.223610 -0.239168 -0.234334 0.243282 0.230722 0.227518 0.279971 0.222254 0.284994 0.226167 0.228878 0.231114 0.234237 0.230603 0.234533
chargesum: 0.00000
title: Mulliken charges with hydrogens summed into heavy atoms:
elementType: O O C C C C C C C C C C C C C C C C C
charge: -0.278941 -0.209525 0.129508 0.346140 0.250996 0.321926 -0.020479 -0.095004 0.053009 -0.163597 -0.089715 -0.151801 -0.063397 -0.017083 -0.006827 -0.007471 0.010627 -0.008565 0.000200
polarizability: 4.30539849e+02 -4.63585783e+00 1.85189953e+02 7.85916111e-02 -2.48094992e+00 7.74354661e+01
1716.lowfreq: -4.2960 -3.6258 -0.0003 0.0002 0.0005 3.6944 26.9557 31.6711 54.7988
frequency: 26.8500 31.5627 54.7958 80.0284 101.3950 135.3911 172.0704 205.4234 215.7044 298.0921 338.2373 359.7316 398.8470 401.0568 407.1459 416.9503 480.9389 516.3066 529.5643 578.4425 598.7366 615.0644 616.8633 655.4285 691.4226 692.8594 696.7525 701.2254 726.8948 773.1709 782.6305 805.7856 826.4034 846.7383 854.3624 922.6013 924.2334 937.2120 947.3822 975.2706 986.0569 986.7050 988.0985 989.5242 996.9527 1007.5316 1023.4984 1033.7371 1059.5739 1088.6158 1090.2491 1122.9817 1175.3469 1176.1958 1195.3732 1203.7387 1270.1916 1304.4116 1308.8851 1317.8072 1337.9856 1345.9570 1379.7768 1388.8058 1436.9158 1441.8368 1482.9807 1486.6071 1548.2145 1575.9920 1581.8416 1595.4366 1610.1992 1612.6703 1672.0864 3123.0828 3130.8219 3132.9932 3140.4669 3144.6333 3147.6653 3152.8583 3162.2338 3165.5074 3179.0285 3185.4801 3192.2905
redmass: 4.1383 5.2722 4.5040 5.2470 6.2545 5.4220 5.6693 5.4231 6.7298 5.4379 6.1685 4.6569 2.8459 3.1477 4.6142 5.3149 3.3465 4.5901 6.5601 6.2576 7.2870 6.4528 6.4768 3.7165 3.8231 1.9605 2.0885 6.0886 4.9643 1.8696 1.9112 7.3800 1.4865 1.2575 1.2562 1.5329 5.0471 1.4423 1.4264 1.4041 1.3813 6.0159 6.0434 5.5836 1.4103 1.3369 2.9878 2.0679 2.4654 1.6219 1.6863 1.6603 1.0546 1.0568 1.1283 1.1300 3.1436 1.8510 1.8418 1.5684 1.8917 1.9977 6.3641 8.0799 2.3482 2.3751 2.3489 2.2815 6.9173 5.1291 5.7117 6.1350 5.9198 5.8967 11.9667 1.0850 1.0851 1.0883 1.0885 1.0926 1.0915 1.0939 1.0994 1.0980 1.0978 1.0954 1.0937
irintensity: 1.0344 0.3430 2.1080 0.3308 0.2767 0.5307 1.2856 0.3063 0.9051 0.4265 0.1483 1.1056 0.0085 0.4531 1.1712 1.0039 6.0014 8.3475 11.1181 4.1672 2.5030 0.0597 0.9988 9.6259 32.7333 22.4042 47.5102 5.6192 2.8947 137.0275 17.6390 34.1745 20.9632 1.3320 0.9276 3.4891 1.8397 3.9509 0.1299 1.7172 0.2842 4.3532 0.5785 9.0823 1.2716 0.4319 16.0721 3.2282 4.2960 13.9854 7.4353 9.4694 0.0026 0.4384 9.1369 5.9401 19.4148 1.7549 11.7690 19.7013 18.4141 27.6580 11.4425 0.2476 6.8599 27.3243 48.3341 3.8627 148.2351 38.8983 6.8972 80.2273 4.5011 4.5066 336.4204 6.0643 3.3184 4.1445 4.8791 22.8901 25.7874 23.7691 43.2117 27.0119 12.0015 8.3350 9.1335
temp: 298.150 k
press: 1.00000 atm
elementType: 8 8 6 6 6 6 6 6 6 6 6 6 6 6 6 6 6 6 6 1 1 1 1 1 1 1 1 1 1 1 1
symmnumber: 1
zpe: 622174.3 jmol-1
zpe.correction: 0.236974 hartree
zpe.thermalcorrener: 0.251876 hartree
zpe.thermalcorrenthalpy: 0.252820 hartree
zpe.thermalcorrgfe: 0.193196 hartree
zpe.sumelectzpe: -804.166673 hartree
zpe.sumelectthermal: -804.151771 hartree
zpe.sumelectthermalent: -804.150826 hartree
zpe.sumelectthermalfe: -804.210450 hartree
dipole: 1.7950 -4.2037 -0.5725
dipole: 4.6066
quadrupole: -82.6890 -104.0888 -115.7264
quadrupole: 1.9372 0.4403 -2.1339
quadrupole: 18.1457 -3.2540 -14.8916 1.9372 0.4403 -2.1339
hfenergy: -804.4036463 hartree
pointgroup: C01 [X(C17H12O2)]
dipole: -0.7025255 1.4872638 0.7610382 debye
polarizability: 430.518308|-4.2400596|147.6909586|-2.9674779|51.4021087|114.9560012 unknown
InChI: InChI=1S/C17H12O2/c18-17-15(13-7-3-1-4-8-13)11-12-16(19-17)14-9-5-2-6-10-14/h1-12H
charge 0 multiplicity 1
31 atoms
O  -0.858101 -0.799645 -0.475783
O  1.00114 -1.96082 -1.151633
C  1.372238 0.172353 0.019421
C  2.858862 0.125799 0.026263
C  -1.514932 0.28636 0.086906
C  -2.984148 0.17593 0.043675
C  0.667499 1.254208 0.562416
C  -0.75568 1.327629 0.605911
C  0.605319 -0.928258 -0.577358
C  3.588027 0.829565 1.030121
C  3.59788 -0.591251 -0.958681
C  -3.816783 1.192649 0.592667
C  -3.593513 -0.963632 -0.554002
C  4.996903 0.837975 1.036689
C  5.00882 -0.578831 -0.950186
C  -5.218964 1.071391 0.542507
C  -4.997144 -1.079786 -0.60068
C  5.717715 0.136838 0.041218
C  -5.816914 -0.064778 -0.054318
H  1.235585 2.10298 0.957261
H  -1.242567 2.203981 1.035763
H  3.051301 1.344301 1.835344
H  3.063135 -1.161226 -1.721705
H  -3.375813 2.078737 1.061132
H  -2.953183 -1.744097 -0.974179
H  5.532672 1.377606 1.825642
H  5.555123 -1.133828 -1.720883
H  -5.847344 1.860931 0.968672
H  -5.452246 -1.962134 -1.063239
H  6.813308 0.139106 0.047124
H  -6.907899 -0.156353 -0.091588
