program: Gaussian 09
title: 000296680
version: EM64L-G09RevD.01
frameworkgroup: C1[X(C16H13NO)]
method: RPBEPBE
basis: SDD
operation: Freq
keyword: #p
keyword: freq=noraman
keyword: PBEPBE/SDD
title: #p freq=noraman PBEPBE/SDD
converged: YES YES NO NO
title: Mulliken charges:
elementType: O N C C C C C C C C C C C C C C C C H H H H H H H H H H H H H
charge: -0.226694 -0.073483 0.303664 0.246790 0.107388 -0.474323 0.328769 0.436576 -0.355229 -0.351243 -0.425192 -0.357459 -0.362455 -0.355955 -0.807346 -0.248743 -0.233213 -0.236030 0.246451 0.225288 0.267934 0.233922 0.233849 0.220139 0.271996 0.234776 0.226403 0.234428 0.227718 0.230231 0.231043
chargesum: 0.00000
title: Mulliken charges with hydrogens summed into heavy atoms:
elementType: O N C C C C C C C C C C C C C C C C
charge: -0.226694 -0.073483 0.303664 0.246790 0.107388 -0.227872 0.328769 0.436576 -0.129941 -0.083309 -0.191270 -0.123610 -0.142316 -0.083959 -0.111739 -0.021025 -0.002982 -0.004987
polarizability: 3.54634156e+02 1.88111563e+00 1.74699547e+02 -1.36760556e-01 -1.69593092e-01 7.56457318e+01
1716.lowfreq: -19.1815 -1.6808 -0.0010 -0.0007 -0.0005 3.4800 15.7106 23.2036 32.2777
frequency: -18.6695 22.6846 32.2497 61.6261 62.1669 103.6450 161.7135 182.8529 222.7334 282.2554 313.2688 358.4572 387.2616 396.5566 400.3598 402.3312 492.2524 493.6635 501.0005 601.6448 616.4072 634.8722 639.2628 680.0377 681.3907 697.9465 722.7568 779.3898 789.6085 826.2926 835.0136 853.1402 853.6465 856.6743 917.2764 928.5421 932.7821 961.5161 983.7184 985.7227 985.9300 989.8381 997.6379 1003.6691 1019.3707 1025.8496 1047.6887 1071.1587 1090.0132 1126.4871 1174.8496 1192.5860 1197.6924 1220.6343 1227.1542 1244.0906 1305.3318 1316.6179 1356.7587 1371.3657 1389.0348 1397.3422 1414.2551 1422.1849 1449.8985 1469.0494 1472.8403 1493.0264 1515.0350 1572.8387 1584.2150 1596.4049 1618.9909 1626.9690 2977.8382 3055.8704 3086.9462 3125.4318 3126.7203 3127.1546 3134.9277 3147.1408 3149.7519 3158.6925 3164.9577 3169.7151 3244.2385
redmass: 1.0310 4.0168 4.4558 4.8000 4.6392 4.5342 4.8673 4.3937 6.0634 4.5405 3.2546 5.3436 6.9449 4.7904 2.7989 2.8201 3.5321 4.6974 3.2515 5.3783 6.4067 6.9682 6.2830 6.3101 2.3175 2.0378 2.8264 1.7498 5.1423 1.4262 1.7007 1.2936 11.4424 1.3073 9.7443 8.0356 1.4459 1.3478 1.3807 1.3676 1.4169 6.1607 4.3688 1.3301 2.4158 2.4554 1.5697 2.0596 1.8483 1.3740 1.0559 1.1407 1.1215 1.8289 2.9279 4.1129 1.7577 1.3148 2.7756 4.3820 8.8293 1.2586 3.4332 2.9835 2.6009 1.0459 1.1256 2.5864 3.5324 5.7351 6.6169 6.9807 6.0189 6.2947 1.0373 1.0974 1.0988 1.0878 1.0848 1.0891 1.0881 1.0932 1.0964 1.0964 1.0957 1.1010 1.0982
irintensity: 0.5771 1.0100 1.0993 0.7443 1.1265 0.1369 2.1139 1.2168 0.3422 0.4738 0.4797 0.8227 0.0872 3.6423 0.0314 0.0015 15.3563 5.2212 8.6118 0.3277 0.0260 0.1641 0.0766 17.5600 21.5745 32.7882 0.1311 74.5055 1.3122 84.4547 0.3445 3.4561 15.7035 0.1974 4.7983 9.1270 4.4771 1.5721 0.1158 0.9462 4.5539 0.4417 4.8894 0.4203 6.9597 7.0019 13.5492 0.9576 9.7449 13.2450 0.0215 9.2799 9.0956 1.4917 0.7714 1.5284 5.2765 1.1641 6.4415 10.9490 11.1450 6.9360 8.3997 54.4797 39.9875 13.6830 16.8477 99.4912 25.7500 10.6546 25.4521 29.5316 0.0010 36.1946 38.0535 18.7179 19.0358 9.1171 5.3596 27.5676 4.1941 31.7335 17.0332 20.6501 2.1751 19.9897 1.7407
temp: 298.150 k
press: 1.00000 atm
elementType: 8 7 6 6 6 6 6 6 6 6 6 6 6 6 6 6 6 6 1 1 1 1 1 1 1 1 1 1 1 1 1
symmnumber: 1
zpe: 635880.5 jmol-1
zpe.correction: 0.242194 hartree
zpe.thermalcorrener: 0.256359 hartree
zpe.thermalcorrenthalpy: 0.257303 hartree
zpe.thermalcorrgfe: 0.198936 hartree
zpe.sumelectzpe: -746.210726 hartree
zpe.sumelectthermal: -746.196561 hartree
zpe.sumelectthermalent: -746.195617 hartree
zpe.sumelectthermalfe: -746.253984 hartree
dipole: -1.6757 3.2366 0.0367
dipole: 3.6448
quadrupole: -75.1314 -98.6805 -111.8873
quadrupole: 2.4940 -0.0348 -0.1297
quadrupole: 20.1016 -3.4474 -16.6542 2.4940 -0.0348 -0.1297
hfenergy: -746.4529201 hartree
pointgroup: C01 [X(C16H13N1O1)]
dipole: 0.6539869 -1.2738843 -0.0764116 debye
polarizability: 354.6458733|1.1630751|174.1788201|-0.4258863|7.0779736|76.1547413 unknown
InChI: InChI=1S/C16H13NO/c1-12-7-9-14(10-8-12)16-11-15(17-18-16)13-5-3-2-4-6-13/h2-11H,1H3
charge 0 multiplicity 1
31 atoms
O  0.296074 1.666475 0.14625
N  -1.163562 1.693208 0.151462
C  2.171736 0.092279 0.043258
C  0.728401 0.329231 0.06034
C  -1.535196 0.382453 0.069109
C  -0.390907 -0.49112 0.010888
C  -2.968269 0.022305 0.051335
C  4.999151 -0.373831 0.009795
C  2.688401 -1.226229 -0.070443
C  3.087153 1.177451 0.139922
C  4.07928 -1.450249 -0.086311
C  4.473796 0.94185 0.122821
C  -3.374154 -1.336043 -0.031635
C  -3.96446 1.035506 0.118551
C  6.497671 -0.613456 -0.006315
C  -4.743968 -1.675286 -0.046829
C  -5.33115 0.693924 0.103265
C  -5.728179 -0.662628 0.020601
H  -0.400547 -1.575311 -0.055448
H  2.0037 -2.07818 -0.148085
H  2.699107 2.196941 0.227937
H  4.458359 -2.47515 -0.175131
H  5.164033 1.790862 0.198649
H  -2.623488 -2.13228 -0.084215
H  -3.650602 2.082241 0.182704
H  6.971111 -0.251999 0.92601
H  6.73631 -1.685377 -0.111905
H  6.98078 -0.075137 -0.843322
H  -5.042781 -2.727375 -0.111168
H  -6.088518 1.483754 0.15583
H  -6.791483 -0.926432 0.008881
