program: Gaussian 09
title: 000296693
version: EM64L-G09RevD.01
frameworkgroup: C1[X(C21H17NO2)]
method: RPBEPBE
basis: SDD
operation: Freq
keyword: #p
keyword: freq=noraman
keyword: PBEPBE/SDD
title: #p freq=noraman PBEPBE/SDD
converged: YES YES NO NO
title: Mulliken charges:
elementType: O O N C C C C C C C C C C C C C C C C C C C C C H H H H H H H H H H H H H H H H H
charge: -0.267212 -0.254753 -0.101338 0.342633 0.024094 0.300122 -0.498683 -0.382378 0.340793 -0.381840 -0.361015 -0.224111 -0.373537 0.272889 -0.231663 -0.248612 -0.007838 -0.232183 -0.342869 -0.327973 -0.233189 -0.228822 -0.228001 -0.536377 0.286838 0.262793 0.261234 0.301694 0.227824 0.246018 0.230836 0.234831 0.232368 0.246885 0.271623 0.228043 0.229539 0.229576 0.223203 0.219887 0.248673
chargesum: 0.00000
title: Mulliken charges with hydrogens summed into heavy atoms:
elementType: O O N C C C C C C C C C C C C C C C C C C C C C
charge: -0.267212 -0.254753 -0.101338 0.342633 0.024094 0.300122 -0.211846 -0.119585 0.340793 -0.120606 -0.059321 0.003712 -0.127519 0.272889 -0.000827 -0.013781 -0.007838 0.000185 -0.095984 -0.056350 -0.005146 0.000717 0.001576 0.155386
polarizability: 3.19683701e+02 -3.04171374e+00 2.68186927e+02 -2.07299340e+01 9.73936226e+00 1.69837077e+02
1716.lowfreq: -10.4082 -3.1087 -2.4189 -0.0007 -0.0003 0.0007 18.5772 26.0088 29.8722
frequency: 18.2937 25.8920 29.6679 36.3630 58.8180 75.9011 84.3789 102.9848 130.1520 156.1787 181.2477 203.8612 212.9059 227.1023 238.2507 252.4406 267.6439 296.9169 362.0472 398.9779 402.0242 408.1992 437.6692 441.6316 449.9466 474.3176 544.0664 546.1080 577.6198 611.9484 613.5605 618.2610 652.6618 676.2880 678.4051 695.3449 702.0923 712.4468 716.3667 751.6183 787.4389 795.8764 801.0182 812.8246 860.1089 863.4450 893.8431 915.2271 938.0550 946.0259 947.9944 976.1658 982.0803 986.3418 989.6871 990.0208 990.4713 1005.1591 1006.1000 1014.8043 1017.8630 1031.2525 1044.6852 1080.2761 1086.4332 1099.7490 1111.7658 1139.2442 1158.7227 1171.6870 1175.5013 1178.1832 1186.8314 1200.5388 1219.9380 1256.4768 1283.9504 1296.4489 1311.1626 1333.6268 1375.3709 1388.3576 1394.3482 1429.2008 1433.8237 1434.6219 1443.4487 1467.9549 1471.3013 1473.1241 1475.7932 1480.4318 1517.8205 1578.9743 1581.3594 1593.5782 1606.1597 1608.4381 1611.9421 1638.7002 2960.3304 3048.6089 3126.3530 3127.0725 3127.4534 3136.7788 3136.9335 3137.4483 3148.1829 3148.9598 3157.6249 3158.5068 3162.4704 3167.9763 3168.3521 3169.5124 3174.3510
redmass: 5.5250 3.9064 4.9103 5.2034 4.4493 4.4110 3.9772 5.1943 5.2756 5.8643 5.2286 1.9202 3.2757 4.9123 6.0050 4.7841 1.9150 4.1478 7.2918 4.0905 3.1640 3.3335 3.5765 3.7934 4.9157 4.4940 5.1700 5.2755 5.8095 6.3439 6.4322 6.4359 6.3930 5.4559 3.5792 2.5237 2.1435 1.6740 2.7459 4.1112 2.0181 1.9726 2.5571 4.9680 1.2479 1.2457 1.4061 1.5703 2.0191 1.4727 2.5403 1.3393 5.5111 3.0491 3.6495 1.6340 1.7539 1.3439 1.3328 3.9461 2.9344 2.1107 2.5219 1.5816 1.6596 1.6729 1.2595 1.9474 1.4194 1.0632 1.0564 1.1417 1.2012 1.1377 3.4349 4.3395 1.8994 2.1146 1.3495 1.4218 6.6512 10.0363 9.1345 1.6032 2.2571 2.2631 1.8415 1.0505 2.3093 1.0871 2.3129 2.2638 9.5046 5.7479 6.0093 6.5480 5.9295 6.1298 6.8335 11.3031 1.0330 1.1040 1.0849 1.0851 1.0992 1.0882 1.0882 1.0874 1.0933 1.0926 1.0967 1.0960 1.0916 1.1015 1.1011 1.0920 1.0974
irintensity: 0.7917 0.2661 0.6505 1.1222 0.5910 2.8464 2.6467 4.2432 0.1843 1.3752 1.6625 0.9169 1.6670 3.9452 4.0914 2.1068 1.0685 0.8045 12.7663 2.5789 1.2622 1.1533 1.9592 4.1050 1.2296 1.3903 5.6783 2.9859 8.8384 6.9119 0.3115 42.3961 14.3180 2.6680 10.7420 10.7267 51.2862 137.3559 41.4414 19.5621 35.1757 19.2790 20.4830 33.8058 0.4844 4.8381 3.7000 17.4190 32.3861 5.5436 52.6699 1.5624 1.0993 0.3606 1.2877 4.4907 0.8463 3.5988 0.3493 33.1345 48.3227 18.0628 56.2728 7.6305 7.0847 19.0742 0.1574 30.6051 18.4202 2.4045 1.1232 43.3643 0.4912 8.6074 120.4658 285.8032 196.4490 79.9784 7.5211 31.9034 2.9945 2.6017 16.2654 68.5263 9.6290 13.6821 68.1312 13.0984 26.3589 12.0788 11.8142 13.1339 156.9461 16.0121 48.7380 9.2737 37.6949 31.4153 58.5253 439.9263 75.2674 46.6121 0.2701 0.2429 22.8470 5.1986 7.8416 11.9992 20.4200 23.2154 7.5259 19.1594 11.6137 36.1479 20.2403 1.8357 13.8711
temp: 298.150 k
press: 1.00000 atm
elementType: 8 8 7 6 6 6 6 6 6 6 6 6 6 6 6 6 6 6 6 6 6 6 6 6 1 1 1 1 1 1 1 1 1 1 1 1 1 1 1 1 1
symmnumber: 1
zpe: 838697.6 jmol-1
zpe.correction: 0.319443 hartree
zpe.thermalcorrener: 0.340066 hartree
zpe.thermalcorrenthalpy: 0.341010 hartree
zpe.thermalcorrgfe: 0.267223 hartree
zpe.sumelectzpe: -1013.960634 hartree
zpe.sumelectthermal: -1013.940011 hartree
zpe.sumelectthermalent: -1013.939067 hartree
zpe.sumelectthermalfe: -1014.012854 hartree
dipole: 3.6957 0.8148 -3.9288
dipole: 5.4550
quadrupole: -105.6148 -123.2146 -144.5830
quadrupole: -4.1997 2.9137 2.3871
quadrupole: 18.8560 1.2562 -20.1122 -4.1997 2.9137 2.3871
hfenergy: -1014.2800769 hartree
pointgroup: C01 [X(C21H17N1O2)]
dipole: 1.3121922 0.3286975 -1.6661781 debye
polarizability: 315.8390299|-0.8255249|268.5967544|-32.2494481|3.9445846|173.2719213 unknown
InChI: InChI=1S/C21H17NO2/c1-24-19-14-8-13-18(15-19)20(16-9-4-2-5-10-16)22-21(23)17-11-6-3-7-12-17/h2-15H,1H3
charge 0 multiplicity 1
41 atoms
O  4.160234 -2.287009 -0.260428
O  -2.004183 0.048139 2.416975
N  -0.297601 -0.297097 0.857163
C  1.797006 0.534808 0.020985
C  0.333259 0.703039 0.296957
C  -0.35243 1.97463 -0.112551
C  2.349192 -0.767128 -0.015055
C  2.649395 1.661811 -0.157384
C  3.732082 -0.952033 -0.235614
C  -0.133812 2.517358 -1.409263
C  -1.255639 2.628698 0.771029
C  4.028605 1.467431 -0.367642
C  4.584568 0.168508 -0.415354
C  -2.419816 -1.49234 0.58133
C  -0.814753 3.682634 -1.820158
C  -1.917336 3.8060 0.360716
C  -1.590199 -0.492224 1.338811
C  -1.704658 4.333987 -0.933871
C  -1.92476 -2.180169 -0.55684
C  -3.749573 -1.725646 1.018536
C  -2.753672 -3.086012 -1.252658
C  -4.575442 -2.632091 0.323118
C  -4.079975 -3.313458 -0.814986
C  5.590586 -2.540594 -0.451949
H  1.705888 -1.637104 0.14399
H  2.239251 2.674104 -0.105307
H  0.552384 2.013656 -2.098826
H  -1.425926 2.216556 1.770643
H  4.686128 2.3347 -0.492331
H  5.657906 0.043249 -0.585961
H  -0.651283 4.08174 -2.827246
H  -2.601762 4.307999 1.053014
H  -2.226799 5.244007 -1.250048
H  -0.893008 -2.011337 -0.88272
H  -4.10576 -1.184583 1.901474
H  -2.367856 -3.618073 -2.129269
H  -5.601728 -2.809166 0.66334
H  -4.722034 -4.018579 -1.355099
H  6.191826 -2.089635 0.361319
H  5.941442 -2.158507 -1.430541
H  5.692155 -3.63517 -0.424202
