program: Gaussian 09
title: 000296691
version: EM64L-G09RevD.01
frameworkgroup: C1[X(C19H20O3)]
method: RPBEPBE
basis: SDD
operation: Freq
keyword: #pfreq=noraman
keyword: PBEPBE/SDD
title: #p freq=noraman PBEPBE/SDD
converged: YES YES NO NO
title: Mulliken charges:
elementType: O O O C C C C C C C C C C C C C C C C C C C H H H H H H H H H H H H H H H H H H H H
charge: -0.277175 -0.266028 -0.252473 0.075297 -0.294706 0.335491 0.445239 0.181020 0.330347 -0.376241 -0.386250 -0.368643 -0.391383 -0.712402 -0.700070 -0.709741 -0.227879 -0.224424 -0.236123 -0.229383 -0.240166 -0.238579 0.241433 0.275284 0.280972 0.280711 0.236138 0.236354 0.211132 0.265917 0.234553 0.226923 0.203776 0.262899 0.214391 0.227436 0.226311 0.226410 0.227654 0.227667 0.228715 0.229595
chargesum: 0.00000
title: Mulliken charges with hydrogens summed into heavy atoms:
elementType: O O O C C C C C C C C C C C C C C C C C C C
charge: -0.277175 -0.266028 -0.252473 0.075297 -0.053272 0.335491 0.445239 0.181020 0.330347 -0.100957 -0.105278 -0.087932 -0.155245 0.001001 -0.034818 -0.005015 -0.001568 0.001985 -0.008470 -0.001716 -0.011451 -0.008984
polarizability: 2.79796558e+02 -4.40900496e-01 1.80252370e+02 6.99750655e-01 1.08067086e+01 1.72291989e+02
1716.lowfreq: -6.9098 -5.2218 -0.0005 -0.0005 0.0005 6.2146 16.5660 32.9627 35.0736
frequency: 16.2985 32.8487 34.9674 47.1557 53.8492 64.6595 110.0647 119.7938 125.3141 171.4573 174.8264 200.7451 208.7227 227.7604 234.8379 244.3400 274.1820 303.4335 331.4959 345.5832 368.6941 397.7858 404.5629 405.7395 414.5988 433.8683 444.9363 486.9826 512.1457 556.9100 599.7220 614.0585 615.2589 619.6871 698.0010 700.8766 706.9755 708.9966 751.3074 759.2762 769.9419 800.2954 821.5544 841.3124 857.9618 865.9615 869.7145 916.0949 917.8502 925.3497 940.6234 953.2227 953.3222 982.3209 988.3324 988.8557 992.2501 998.6844 1001.1642 1026.6003 1026.6762 1030.2099 1033.6128 1065.1084 1080.7074 1083.5751 1129.6278 1172.1041 1172.7579 1176.9362 1185.6274 1191.7300 1215.5584 1249.2227 1258.6857 1268.0578 1287.3371 1314.5920 1321.4200 1358.2711 1373.4995 1378.0889 1378.8739 1387.8799 1400.5296 1434.5137 1441.2179 1443.7888 1465.6512 1467.1405 1469.6181 1478.2304 1479.1474 1485.4180 1501.6005 1586.9729 1591.0846 1600.9457 1610.4150 1615.3558 2991.3107 2992.2365 2996.9362 3078.1356 3083.8090 3086.2254 3096.7014 3100.8169 3113.8728 3118.5815 3120.1312 3125.1127 3127.2453 3136.7641 3141.5782 3151.7822 3156.2367 3161.8223 3166.2042 3169.0817
redmass: 4.2779 3.7285 3.7976 4.3101 4.1448 4.4045 4.9985 4.0072 5.2204 4.4888 1.0981 4.5452 4.0165 4.9625 1.0507 1.0735 4.9697 3.6895 2.7677 4.2548 4.1457 2.9079 2.8747 2.9659 6.5056 2.9987 3.1349 3.6410 5.3369 3.6909 7.1737 6.4041 6.3909 6.4157 5.3890 3.6266 2.3845 2.2544 2.1321 3.9053 2.0024 3.4286 4.2247 5.7119 1.2836 1.7399 2.7542 1.6730 1.6047 1.5505 1.5119 1.2480 2.6885 1.3784 6.2622 6.1506 1.3607 1.3188 1.2993 1.4833 2.0429 2.0785 1.4272 1.5283 1.5851 1.5938 3.6743 1.0674 1.0605 2.2175 1.1212 1.1320 2.6916 2.6503 3.0320 2.8234 3.1709 1.5045 1.4526 2.1283 1.2256 1.5797 3.3196 5.3734 1.2164 2.2728 2.1034 1.0673 1.0554 1.0658 1.0592 1.0607 2.2153 2.4038 1.0580 6.1503 6.1194 9.8242 6.0198 6.0062 1.0361 1.0358 1.0366 1.0888 1.0989 1.0990 1.0993 1.1002 1.1004 1.0996 1.0863 1.0849 1.0876 1.0891 1.0928 1.0934 1.0955 1.0950 1.1005 1.1002
irintensity: 0.9290 0.2197 0.0036 0.4725 0.0724 0.9736 2.1114 0.0914 1.4570 0.7331 0.1633 0.1098 6.5253 0.1649 0.0202 0.2329 5.7296 9.9683 3.1404 0.3697 2.2501 0.4038 0.1351 0.2107 2.1452 2.1454 2.9165 7.5171 5.0996 22.8669 28.1845 0.1200 0.0440 2.0485 10.0573 20.8637 25.9958 72.2732 31.8423 9.3236 79.2201 6.8844 5.4564 6.0150 2.3621 6.1911 8.8800 6.3547 1.1064 4.5056 16.6213 1.5389 26.7143 0.6441 0.2148 0.1954 0.3307 1.0827 0.4530 1.4092 4.8124 14.2976 0.2947 86.4606 20.2402 10.6888 289.0209 2.1998 1.7389 54.1347 3.0496 4.1322 27.2277 3.4410 31.2206 42.8583 40.8531 3.0163 6.7123 4.6981 36.3960 31.1491 9.2716 0.3746 23.9802 14.7792 11.5397 1.5021 2.4738 17.0372 5.0989 2.7168 28.4153 16.3866 29.2922 0.1004 1.9248 108.7241 9.9134 5.1905 18.2175 9.4084 29.5018 15.8698 7.8497 14.0400 55.8748 26.1645 7.1869 13.9112 5.9626 0.0316 1.8761 16.2396 24.8653 17.7609 21.5255 9.4123 20.7498 25.1470
temp: 298.150 k
press: 1.00000 atm
elementType: 8 8 8 6 6 6 6 6 6 6 6 6 6 6 6 6 6 6 6 6 6 6 1 1 1 1 1 1 1 1 1 1 1 1 1 1 1 1 1 1 1 1
symmnumber: 1
zpe: 886794.8 jmol-1
zpe.correction: 0.337762 hartree
zpe.thermalcorrener: 0.358787 hartree
zpe.thermalcorrenthalpy: 0.359731 hartree
zpe.thermalcorrgfe: 0.286276 hartree
zpe.sumelectzpe: -960.070698 hartree
zpe.sumelectthermal: -960.049674 hartree
zpe.sumelectthermalent: -960.048730 hartree
zpe.sumelectthermalfe: -960.122185 hartree
dipole: -0.9830 0.7918 -0.5277
dipole: 1.3681
quadrupole: -111.9685 -117.1255 -133.3569
quadrupole: -4.4371 0.1733 3.7239
quadrupole: 8.8485 3.6915 -12.5399 -4.4371 0.1733 3.7239
hfenergy: -960.4084606 hartree
pointgroup: C01 [X(C19H20O3)]
dipole: -0.333386 -0.3504916 0.2360701 debye
polarizability: 275.9660351|18.6094783|186.9255216|1.4900457|9.6939034|169.449361 unknown
InChI: InChI=1S/C19H20O3/c1-18(2,3)22-17(20)19(15-12-8-5-9-13-15)16(21-19)14-10-6-4-7-11-14/h4-13,16H,1-3H3
charge 0 multiplicity 1
42 atoms
O  0.343683 0.423549 -1.769907
O  -0.076963 -1.886832 -0.272096
O  0.162192 -0.731802 1.755667
C  0.768323 0.361986 -0.335026
C  -0.231797 1.424069 -0.799766
C  2.201459 0.768883 -0.070657
C  -1.704748 1.369625 -0.555722
C  0.243127 -0.799542 0.50343
C  -0.568674 -3.200902 0.363813
C  3.025843 1.125909 -1.168127
C  2.728708 0.82464 1.246517
C  -2.500796 0.325849 -1.091529
C  -2.320244 2.397123 0.204688
C  -1.867503 -2.939449 1.150378
C  -0.816356 -4.069968 -0.879361
C  0.560675 -3.76904 1.244306
C  4.360025 1.53515 -0.952573
C  4.063918 1.234897 1.454606
C  -3.893387 0.308069 -0.858956
C  -3.711129 2.371288 0.443688
C  4.884372 1.592083 0.359195
C  -4.50241 1.32596 -0.087937
H  0.202783 2.429381 -0.900635
H  2.609629 1.067615 -2.179007
H  2.094787 0.549612 2.095162
H  -2.016306 -0.444399 -1.700507
H  -1.710555 3.212448 0.61326
H  -2.610246 -2.423062 0.517553
H  -2.296437 -3.90801 1.46704
H  -1.678768 -2.326358 2.045064
H  0.108718 -4.173875 -1.471532
H  -1.590452 -3.618288 -1.523357
H  -1.155253 -5.075605 -0.572388
H  0.75612 -3.117542 2.110397
H  0.264507 -4.76715 1.615812
H  1.490096 -3.881233 0.658952
H  4.990165 1.803714 -1.807956
H  4.462602 1.277776 2.474492
H  -4.506244 -0.493564 -1.286826
H  -4.177732 3.165854 1.036458
H  5.919895 1.909313 0.526327
H  -5.583429 1.310228 0.090561
