program: Gaussian 09
title: 000296683
version: EM64L-G09RevD.01
frameworkgroup: C1[X(C17H14O4)]
method: RPBEPBE
basis: SDD
operation: Freq
keyword: #pfreq=noraman
keyword: PBEPBE/SDD
title: #p freq=noraman PBEPBE/SDD
converged: NO YES NO NO
title: Mulliken charges:
elementType: O O O O C C C C C C C C C C C C C C C C C H H H H H H H H H H H H H H
charge: -0.278334 -0.205204 -0.457631 -0.167559 0.188210 0.008387 -0.148796 -0.579110 0.339768 0.412747 0.173907 -0.385769 -0.397547 -0.384860 -0.406816 -0.229213 -0.226686 -0.237612 -0.220486 -0.240466 -0.240417 0.265411 0.281416 0.292862 0.359932 0.292086 0.269765 0.263047 0.281717 0.229471 0.228604 0.229160 0.228282 0.231541 0.230194
chargesum: 0.00000
title: Mulliken charges with hydrogens summed into heavy atoms:
elementType: O O O O C C C C C C C C C C C C C C C C C
charge: -0.278334 -0.205204 -0.097700 -0.167559 0.188210 0.008387 0.116615 -0.004832 0.339768 0.412747 0.173907 -0.093683 -0.127781 -0.121812 -0.125099 0.000258 0.001918 -0.008452 0.007796 -0.008925 -0.010223
polarizability: 2.10599447e+02 -6.43085466e+00 1.79725775e+02 4.39709402e+00 1.49402076e+01 1.58591369e+02
1716.lowfreq: -7.9029 -5.5020 -3.2690 0.0003 0.0005 0.0007 30.8514 41.5236 45.7690
frequency: 30.7486 41.4516 45.7668 64.3279 86.3997 100.7188 153.0267 182.3017 219.7600 246.3264 260.2578 272.8111 288.1993 312.9079 334.3240 360.5791 401.4569 402.4188 406.9846 425.7047 446.1628 486.4000 507.1566 532.9295 574.7876 598.3532 615.5635 616.2545 632.5976 662.5492 703.7471 705.2945 707.0498 716.2666 752.6555 768.9134 780.6581 840.8347 850.1442 863.9557 867.2047 925.5747 937.9725 938.9389 945.3133 987.3000 988.2106 988.3331 990.6436 991.5946 1001.2577 1003.8826 1019.7685 1030.1073 1032.3359 1066.4004 1081.3723 1087.9693 1102.9181 1125.1791 1159.3404 1174.4420 1174.8582 1193.1614 1196.9215 1213.9933 1258.8904 1271.8655 1285.1268 1319.2256 1325.8633 1338.3709 1358.0434 1378.4708 1383.5059 1412.1824 1436.9837 1438.3683 1484.1068 1485.3213 1586.6092 1594.2027 1613.2609 1615.1141 1699.6681 3030.0321 3104.0303 3125.1738 3127.6761 3133.1215 3138.1153 3145.8423 3151.6842 3156.9029 3161.1921 3163.1683 3174.0477 3175.8772 3545.1508
redmass: 4.1160 4.7724 4.3153 8.1069 5.6151 6.0316 5.1282 5.5748 5.0505 5.8048 5.4875 4.2615 4.9498 1.2400 4.1183 3.8661 3.5134 3.2978 3.7747 6.2254 7.3677 3.7127 4.5986 4.0607 4.1463 6.4463 6.4227 6.4569 6.4565 5.8390 2.9752 6.5063 2.0975 2.4032 2.6296 2.1896 2.2847 3.3012 5.3276 1.2560 1.2442 2.5327 1.4587 3.5792 2.0113 4.4663 2.9420 1.5448 5.1597 1.6954 1.3260 1.3319 4.0609 2.1653 2.1465 2.1651 1.8873 1.7413 2.4351 2.5486 1.7245 1.0631 1.0612 1.1344 1.1341 1.4578 3.0508 1.4739 1.8490 1.4386 1.3305 1.6575 2.3414 7.8955 8.3881 1.0859 2.2506 2.2662 2.2981 2.2913 6.1130 6.3003 5.9514 5.9876 12.0257 1.0611 1.1004 1.0853 1.0850 1.0886 1.0889 1.0939 1.0936 1.0919 1.0981 1.0975 1.0981 1.0967 1.0663
irintensity: 0.0253 0.1429 0.6089 0.4761 2.6945 0.2299 0.8581 4.9541 2.0706 3.2827 2.7008 1.2121 4.7577 118.9459 2.1762 3.1514 2.6164 1.0736 3.5162 0.6687 6.1746 6.6857 3.3609 13.1414 16.7682 47.1892 0.0372 0.5855 7.4005 5.7367 20.0968 3.2630 88.1546 8.8853 31.3563 87.0145 54.0848 2.9716 61.5203 0.5270 0.6044 12.6253 5.3756 27.3236 24.0051 134.0365 6.8197 0.7241 6.5004 8.0513 5.0220 5.4590 87.4824 10.3516 2.7070 5.1736 67.5762 22.9618 95.4665 87.6496 52.5055 0.9177 0.8162 3.7086 1.9765 28.2119 4.9960 5.3307 8.2578 4.6575 3.9699 27.3424 37.3798 1.2440 1.1155 19.2178 27.4199 1.2138 19.3624 17.1547 1.4688 0.4369 2.8145 3.9228 370.9073 1.0447 1.2151 0.9668 0.0179 5.1428 11.9465 22.6053 15.0045 6.3881 21.9929 17.8055 14.0066 8.0297 10.3327
temp: 298.150 k
press: 1.00000 atm
elementType: 8 8 8 8 6 6 6 6 6 6 6 6 6 6 6 6 6 6 6 6 6 1 1 1 1 1 1 1 1 1 1 1 1 1 1
symmnumber: 1
zpe: 698864.0 jmol-1
zpe.correction: 0.266183 hartree
zpe.thermalcorrener: 0.283550 hartree
zpe.thermalcorrenthalpy: 0.284494 hartree
zpe.thermalcorrgfe: 0.220311 hartree
zpe.sumelectzpe: -955.581019 hartree
zpe.sumelectthermal: -955.563653 hartree
zpe.sumelectthermalent: -955.562708 hartree
zpe.sumelectthermalfe: -955.626891 hartree
dipole: -4.0504 0.8196 0.2024
dipole: 4.1374
quadrupole: -135.8011 -113.7788 -115.7473
quadrupole: 6.3212 0.0194 0.1464
quadrupole: -14.0254 7.9969 6.0284 6.3212 0.0194 0.1464
hfenergy: -955.8472027 hartree
pointgroup: C01 [X(C17H14O4)]
dipole: -1.619686 -0.0891642 0.1354314 debye
polarizability: 211.8161686|2.1722413|169.1524666|-1.0405338|18.3812284|167.947956 unknown
InChI: InChI=1S/C17H14O4/c18-14-11-16(19,12-7-3-1-4-8-12)17(15(20-14)21-17)13-9-5-2-6-10-13/h1-10,15,19H,11H2
charge 0 multiplicity 1
35 atoms
O  1.090066 -0.641678 -1.888549
O  3.090794 -1.279525 -0.526889
O  1.055497 -0.076986 1.854271
O  4.610855 0.283376 0.182465
C  0.557395 -0.794396 -0.438136
C  0.922118 0.4129 0.463179
C  1.74554 -1.56805 -0.942367
C  2.271836 1.034815 -0.006199
C  -0.784556 -1.464943 -0.332497
C  -0.149723 1.506603 0.464831
C  3.427997 0.048419 -0.094942
C  -1.485042 -1.524606 0.901567
C  -1.352169 -2.071165 -1.483195
C  -0.698339 1.941526 -0.767797
C  -0.548852 2.132745 1.668088
C  -2.729962 -2.18542 0.975611
C  -2.598135 -2.729303 -1.402254
C  -1.642995 2.989358 -0.79248
C  -1.495106 3.182545 1.639584
C  -3.291397 -2.791846 -0.171837
C  -2.04405 3.615114 0.41126
H  1.681099 -2.632547 -1.185872
H  2.559176 1.838058 0.691309
H  2.131775 1.482989 -1.005882
H  1.814224 -0.71344 1.913831
H  -1.051275 -1.060959 1.791638
H  -0.82271 -1.999221 -2.439064
H  -0.396884 1.457953 -1.704539
H  -0.122877 1.787661 2.614069
H  -3.262499 -2.225552 1.932299
H  -3.02954 -3.187344 -2.299241
H  -2.066882 3.31613 -1.748485
H  -1.801813 3.66178 2.576061
H  -4.258849 -3.302288 -0.109013
H  -2.776918 4.429395 0.390572
