program: Gaussian 09
title: 000296675
version: EM64L-G09RevD.01
frameworkgroup: C1[X(C16H10O2)]
method: RPBEPBE
basis: SDD
operation: Freq
keyword: #pfreq=noraman
keyword: PBEPBE/SDD
title: #p freq=noraman PBEPBE/SDD
converged: YES YES NO NO
title: Mulliken charges:
elementType: O O C C C C C C C C C C C C C C C C H H H H H H H H H H
charge: -0.182461 -0.205495 0.253929 0.323230 0.265263 -0.158097 0.342709 -0.537040 -0.019172 -0.370494 -0.362793 -0.348415 -0.387287 -0.228117 -0.224304 -0.237693 -0.235272 -0.231534 0.276409 0.287861 0.287520 0.267746 0.245161 0.240969 0.241138 0.231383 0.231076 0.233781
chargesum: 0.00000
title: Mulliken charges with hydrogens summed into heavy atoms:
elementType: O O C C C C C C C C C C C C C C C C
charge: -0.182461 -0.205495 0.253929 0.323230 0.265263 -0.158097 0.342709 -0.260631 -0.019172 -0.082634 -0.075273 -0.080669 -0.142126 0.012851 0.016834 -0.006310 -0.004196 0.002247
polarizability: 3.07399499e+02 1.45918362e+01 1.90485724e+02 -3.13396363e+00 5.93912558e+00 7.71023866e+01
1716.lowfreq: -10.4396 -2.7154 -0.0005 0.0004 0.0005 0.9405 35.3479 55.9896 84.5267
frequency: 35.3276 55.9758 84.5256 120.7619 121.7249 183.9482 222.2719 247.3435 264.1710 303.4840 368.5547 389.9827 403.7342 424.4505 453.1756 467.3124 471.3221 530.1895 566.0047 614.7609 652.7267 661.0008 670.3594 694.6350 703.5956 717.2670 769.5954 792.7440 802.6713 835.4546 842.0250 846.2018 913.5928 924.6903 938.5309 975.1944 987.9489 997.1564 998.2688 1009.1213 1014.8402 1029.7282 1048.0322 1075.2867 1089.9658 1119.8683 1172.1469 1175.9215 1199.6441 1216.8892 1256.0091 1260.4489 1302.5567 1323.5961 1339.9050 1377.5151 1399.0288 1434.6462 1440.3354 1469.9057 1481.1038 1527.8335 1545.7992 1570.3775 1580.0902 1604.5657 1609.7141 1611.3623 3127.1467 3135.8881 3137.6908 3145.6046 3149.5421 3151.9829 3162.7746 3164.6934 3172.5306 3189.4644
redmass: 6.5419 4.3044 5.5909 6.2216 4.8823 5.5898 4.7889 6.7879 5.7577 5.7300 10.2311 4.2745 2.8634 3.8755 10.5490 4.2255 7.5532 3.5795 7.5125 6.4037 5.9013 6.1410 3.5771 1.9188 4.3845 3.0924 2.0332 1.8901 2.9447 3.4260 5.5504 1.2850 1.3915 1.4551 1.7307 1.3967 5.7433 1.3975 1.3410 4.8980 1.3606 2.2426 2.2870 3.0012 1.6441 1.9278 1.0803 1.0546 1.1258 2.3688 1.8151 1.9911 2.6636 1.6951 2.3628 6.8019 9.8838 2.3277 2.5185 2.7378 2.2994 10.2257 9.3376 6.3037 6.3678 6.3219 7.4275 6.7113 1.0855 1.0888 1.0863 1.0914 1.0939 1.0902 1.0947 1.0995 1.1004 1.0956
irintensity: 3.8608 0.1716 1.3045 3.8384 0.4131 0.1591 1.8103 0.5528 0.4858 1.2301 21.2078 1.3400 0.5405 0.7273 4.4933 1.7412 0.4631 10.7649 23.3540 1.1897 1.7895 2.4355 4.1786 45.4983 12.7265 5.0475 88.2648 50.1954 4.3028 1.2892 14.9505 3.3894 12.6243 1.0533 3.9631 2.9806 4.1973 2.9536 0.8711 17.8167 0.0163 10.4008 7.9111 11.0773 5.4166 25.6326 13.7369 0.0403 19.3794 69.3261 93.1774 62.2058 132.6657 115.4650 44.1458 6.2592 0.0697 14.7830 1.3703 7.7107 22.2448 24.2320 267.8502 106.6295 12.3300 40.0312 31.3172 15.2636 1.8959 3.6473 3.7518 7.9218 21.9661 5.3125 2.0453 36.9972 28.0382 4.6135
temp: 298.150 k
press: 1.00000 atm
elementType: 8 8 6 6 6 6 6 6 6 6 6 6 6 6 6 6 6 6 1 1 1 1 1 1 1 1 1 1
symmnumber: 1
zpe: 549541.9 jmol-1
zpe.correction: 0.209309 hartree
zpe.thermalcorrener: 0.222884 hartree
zpe.thermalcorrenthalpy: 0.223828 hartree
zpe.thermalcorrgfe: 0.168222 hartree
zpe.sumelectzpe: -764.942414 hartree
zpe.sumelectthermal: -764.928840 hartree
zpe.sumelectthermalent: -764.927896 hartree
zpe.sumelectthermalfe: -764.983501 hartree
dipole: -0.0535 -1.2704 -0.0694
dipole: 1.2734
quadrupole: -75.9073 -110.2708 -105.7533
quadrupole: -10.1211 0.8764 5.2942
quadrupole: 21.4032 -12.9603 -8.4428 -10.1211 0.8764 5.2942
hfenergy: -765.1517233 hartree
pointgroup: C01 [X(C16H10O2)]
dipole: -0.0217784 -0.4425592 -0.2338362 debye
polarizability: 307.442612|14.3991206|166.1002941|3.2035379|46.9232593|101.4447038 unknown
InChI: InChI=1S/C16H10O2/c17-15-10-14(11-6-2-1-3-7-11)16(18)13-9-5-4-8-12(13)15/h1-10H
charge 0 multiplicity 1
28 atoms
O  -0.188716 -2.046647 -0.603672
O  1.792953 2.815779 1.000583
C  1.747799 -0.677313 -0.198982
C  -0.649796 0.233639 0.102217
C  2.282617 0.570683 0.229087
C  0.269065 -0.909683 -0.265864
C  -2.123471 0.055077 0.047257
C  -0.090845 1.431777 0.50083
C  1.35911 1.681822 0.607746
C  2.627136 -1.7290 -0.556966
C  3.68346 0.756609 0.295454
C  -2.750298 -0.735434 -0.958426
C  -2.949405 0.713607 1.004585
C  4.022819 -1.538329 -0.491962
C  4.55244 -0.294358 -0.065116
C  -4.155538 -0.845747 -1.009874
C  -4.352247 0.594708 0.95524
C  -4.963062 -0.183857 -0.056467
H  -0.724223 2.29388 0.739249
H  2.194852 -2.681805 -0.878348
H  4.062338 1.727421 0.630657
H  -2.137425 -1.255899 -1.697145
H  -2.485551 1.291681 1.811943
H  4.699234 -2.353316 -0.770406
H  5.636963 -0.150189 -0.015243
H  -4.620213 -1.451602 -1.795253
H  -4.967708 1.098201 1.708649
H  -6.053883 -0.278407 -0.095969
