program: Gaussian 09
title: 000296682
version: EM64L-G09RevD.01
frameworkgroup: C1[X(C18H17NO)]
method: RPBEPBE
basis: SDD
operation: Freq
keyword: #p
keyword: freq=noraman
keyword: PBEPBE/SDD
title: #p freq=noraman PBEPBE/SDD
converged: YES YES NO NO
title: Mulliken charges:
elementType: O N C C C C C C C C C C C C C C C C C C H H H H H H H H H H H H H H H H H
charge: -0.218926 -0.092446 -0.410561 -0.419818 -0.588744 0.298344 0.046186 -0.433265 0.303042 0.416068 -0.353193 -0.373497 -0.398121 -0.397907 -0.237784 -0.230695 -0.242146 -0.236228 -0.230799 -0.240009 0.241891 0.211354 0.225237 0.236073 0.203978 0.272582 0.246424 0.259414 0.271274 0.249745 0.237794 0.229177 0.231796 0.230252 0.229321 0.231490 0.232695
chargesum: 0.00000
title: Mulliken charges with hydrogens summed into heavy atoms:
elementType: O N C C C C C C C C C C C C C C C C C C
charge: -0.218926 -0.092446 0.042685 0.041492 -0.112183 0.298344 0.046186 -0.186841 0.303042 0.416068 -0.093779 -0.102224 -0.148376 -0.160113 -0.008607 0.001101 -0.011894 -0.006907 0.000691 -0.007313
polarizability: 2.80509543e+02 -2.05698897e+00 1.90694255e+02 4.46540762e+00 -3.47595368e+01 1.60345225e+02
1716.lowfreq: -10.2287 -7.9735 -0.0002 0.0000 0.0005 4.2945 13.5027 29.0043 36.8380
frequency: 11.0427 28.9899 36.7935 47.0312 58.1529 74.6535 94.8778 118.1862 139.7686 171.3480 201.2737 256.1718 267.5548 304.2033 348.4164 373.1064 391.0672 404.5924 407.0969 415.1356 497.5581 519.0223 538.4953 604.1348 614.1605 615.0015 649.9298 677.8597 700.9958 703.2978 734.2222 736.3966 762.0961 794.8390 797.8370 819.3144 837.4030 854.4021 861.1863 895.3755 923.9647 941.1270 945.8703 969.9004 974.8671 978.8104 988.0033 988.5802 989.6081 997.2473 1003.8146 1008.4833 1027.3075 1028.4120 1061.7665 1074.5076 1081.2469 1083.2803 1105.4999 1139.0468 1149.8616 1173.2263 1173.5718 1184.4656 1191.1030 1220.2654 1238.4445 1252.6782 1270.7499 1314.9801 1322.0360 1336.7597 1365.9563 1384.1602 1389.6106 1433.7954 1436.3721 1447.0395 1456.3525 1471.6656 1475.2893 1480.9832 1542.3536 1579.7701 1588.2598 1607.3205 1608.9064 1635.1049 2954.4138 3046.4298 3052.2710 3061.5375 3085.9006 3121.0096 3126.3482 3129.2972 3136.9317 3142.3723 3148.8301 3153.7923 3157.7918 3162.7617 3167.1709 3168.0112 3179.9265
redmass: 4.2623 5.0772 4.0445 3.8800 3.3674 3.5757 5.3305 5.0703 4.5417 5.1230 4.5802 4.1281 3.5667 6.4872 3.6037 2.1748 5.0095 2.8717 2.8837 3.9072 3.3007 5.1090 4.3357 5.5712 6.3803 6.3662 5.0669 4.1500 1.7580 1.8734 2.9335 2.4903 1.9050 2.1242 1.7501 3.7646 3.7151 1.2514 1.2518 1.7620 1.8660 1.6118 1.5015 1.6098 1.8403 1.6625 1.6282 3.4505 4.7245 1.3504 1.3386 1.8106 2.1018 2.0514 1.2518 1.3171 1.5967 1.6088 1.8527 1.4138 2.3920 1.0567 1.0564 1.1260 1.1180 1.8839 1.9320 3.0433 2.3056 1.3421 1.4907 1.3279 2.6182 8.9968 2.5728 2.2450 2.1957 1.0963 1.0844 1.1780 2.2584 2.2427 9.9352 5.7677 6.3691 6.0646 6.0204 8.1570 1.0636 1.0956 1.0507 1.0622 1.0874 1.0866 1.0850 1.0868 1.0881 1.0923 1.0924 1.0956 1.0961 1.1144 1.1013 1.1011 1.1152
irintensity: 1.3012 1.0257 0.2824 0.1959 2.6029 1.7630 0.6398 2.0227 0.0103 1.8636 2.9157 0.5516 0.5744 5.4578 2.2467 6.5950 2.0585 0.1987 2.0428 8.0875 24.8097 3.4135 23.6779 4.8530 0.5621 0.8662 14.3264 8.1590 59.0503 36.0481 16.0257 22.6264 79.9147 2.2003 6.5585 5.0598 6.8614 0.1486 1.9277 8.1017 12.3129 12.6987 5.2549 33.7943 24.8729 8.0730 2.1373 1.6244 0.4665 0.0994 0.8988 40.9741 4.5544 1.4537 11.8705 12.8207 7.3750 14.3854 2.1649 0.8556 7.3301 0.3063 0.1803 22.9784 1.2753 1.5106 59.3496 116.7198 103.7791 1.8460 29.5563 20.1251 11.7577 2.0913 1.5761 13.3586 14.7576 18.8336 2.1397 11.0717 1.2635 11.2691 142.7372 1.5946 9.1426 11.8350 4.3886 16.2678 52.0219 3.0182 30.9999 30.4673 12.6551 6.4295 0.0815 0.2411 6.7511 18.7040 18.2212 34.0321 20.9038 1.8125 24.4258 19.8403 38.8411
temp: 298.150 k
press: 1.00000 atm
elementType: 8 7 6 6 6 6 6 6 6 6 6 6 6 6 6 6 6 6 6 6 1 1 1 1 1 1 1 1 1 1 1 1 1 1 1 1 1
symmnumber: 1
zpe: 779966.5 jmol-1
zpe.correction: 0.297074 hartree
zpe.thermalcorrener: 0.314878 hartree
zpe.thermalcorrenthalpy: 0.315822 hartree
zpe.thermalcorrgfe: 0.247812 hartree
zpe.sumelectzpe: -824.603335 hartree
zpe.sumelectthermal: -824.585531 hartree
zpe.sumelectthermalent: -824.584586 hartree
zpe.sumelectthermalfe: -824.652597 hartree
dipole: 2.5997 -2.4416 2.4417
dipole: 4.3222
quadrupole: -101.3962 -114.8876 -116.6046
quadrupole: 11.5203 -4.1117 -1.7684
quadrupole: 9.5666 -3.9248 -5.6418 11.5203 -4.1117 -1.7684
hfenergy: -824.9004087 hartree
pointgroup: C01 [X(C18H17N1O1)]
dipole: -0.9724672 0.7971882 1.1447511 debye
polarizability: 279.2351761|-12.5037391|173.7621009|1.1647088|37.8391954|178.5517463 unknown
InChI: InChI=1S/C18H17NO/c20-18(16-9-5-2-6-10-16)17(14-19-11-12-19)13-15-7-3-1-4-8-15/h1-10,13H,11-12,14H2
charge 0 multiplicity 1
37 atoms
O  1.682747 -1.184748 -2.308015
N  -0.505534 -2.701291 -0.198104
C  -1.471309 -3.839033 0.010243
C  -1.316319 -2.759321 1.074129
C  -0.935525 -1.663656 -1.193179
C  -0.114097 -0.417332 -0.918331
C  1.352552 -0.565781 -1.248508
C  -0.579677 0.789499 -0.460357
C  2.40686 0.040603 -0.364206
C  -1.97394 1.237782 -0.242794
C  2.213029 0.215978 1.032159
C  3.661235 0.377379 -0.93996
C  -3.054689 0.893766 -1.105382
C  -2.242485 2.109954 0.852061
C  3.254974 0.728754 1.835411
C  4.694592 0.904107 -0.140083
C  -4.359135 1.371301 -0.855024
C  -3.548005 2.576138 1.109963
C  4.493558 1.082219 1.250809
C  -4.615677 2.203541 0.259425
H  -1.014561 -4.823298 0.151403
H  -2.406895 -3.840563 -0.567358
H  -2.144542 -2.046791 1.193653
H  -0.743898 -2.963764 1.984443
H  -2.027031 -1.466065 -1.147153
H  -0.677096 -2.0521 -2.195357
H  0.178776 1.549126 -0.218228
H  1.262724 -0.083125 1.486756
H  3.802351 0.209183 -2.012879
H  -2.862519 0.297689 -2.00339
H  -1.417144 2.410802 1.509146
H  3.105761 0.846226 2.914531
H  5.655801 1.171284 -0.592779
H  -5.173507 1.105775 -1.538414
H  -3.732439 3.235419 1.96543
H  5.299446 1.485371 1.874572
H  -5.62918 2.572371 0.451666
