program: Gaussian 09
title: 000296668
version: EM64L-G09RevD.01
frameworkgroup: C1[X(C8H12I2O)]
method: RPBEPBE
basis: SDD
operation: Freq
keyword: #p
keyword: freq=noraman
keyword: PBEPBE/SDD
title: #p freq=noraman PBEPBE/SDD
converged: YES YES NO NO
title: Mulliken charges:
elementType: I I O C C C C C C C C H H H H H H H H H H H H
charge: 0.040662 0.036193 -0.227120 0.005127 -0.005034 -0.491191 -0.481209 -0.598330 -0.634525 -0.413309 -0.274285 0.258977 0.280525 0.223202 0.248628 0.248432 0.229931 0.303679 0.280566 0.260287 0.211817 0.225984 0.270993
chargesum: 0.00000
title: Mulliken charges with hydrogens summed into heavy atoms:
elementType: I I O C C C C C C C C
charge: 0.040662 0.036193 -0.227120 0.264105 0.275491 -0.019361 -0.002847 -0.294651 -0.353959 0.058795 0.222692
polarizability: 1.75660423e+02 -3.69647311e-01 1.24271059e+02 5.55871388e-01 8.73065483e+00 9.28551198e+01
1716.lowfreq: -7.9514 -0.0005 -0.0005 0.0001 3.4237 15.2550 32.7828 81.7244 132.2979
frequency: 31.9885 81.6739 132.2562 156.6253 165.6753 191.3312 261.2193 280.3607 322.0014 365.4809 385.2951 492.7761 539.9466 588.3077 640.6005 680.5419 737.4587 779.3339 796.0865 845.1514 867.7143 893.6082 910.0013 941.9592 970.2071 988.3116 1008.1074 1038.6356 1063.1235 1085.3253 1116.0787 1123.9045 1146.2867 1165.8462 1184.7215 1188.0642 1221.3228 1247.6334 1279.1467 1283.6492 1296.8184 1308.1954 1313.0215 1331.4427 1333.8218 1347.9605 1355.7479 1450.6481 1454.5885 1464.8017 1486.5601 2952.4738 3015.9224 3022.1651 3026.0637 3039.4044 3044.7518 3052.0668 3057.1214 3082.0793 3091.0447 3092.7336 3099.6133
redmass: 10.6682 4.7308 5.0994 3.3833 7.1784 5.0550 3.2177 3.1974 2.7617 3.5040 2.5494 3.2338 3.0642 3.4829 3.1697 2.6454 5.7212 3.1662 2.8384 1.9858 2.9459 2.4247 2.4240 2.5027 1.9558 2.9437 2.9207 2.2108 2.0764 2.2339 1.7049 1.2502 1.2332 1.3298 1.4025 1.3480 1.2480 1.2777 1.1841 1.3590 1.5010 1.3272 1.2471 1.2782 1.3146 1.3148 1.3520 1.0836 1.0809 1.0885 1.0855 1.0680 1.0614 1.0622 1.0624 1.0864 1.0858 1.0896 1.0899 1.1012 1.0954 1.0995 1.1010
irintensity: 0.6460 0.8325 0.7455 0.6788 2.3166 0.7733 5.1993 4.2522 3.2674 3.2585 1.5593 3.8041 28.0630 21.9649 12.3883 5.6391 6.8605 18.4820 7.6001 11.1480 10.1783 76.4947 30.5832 10.0797 5.5320 6.6963 6.7300 31.6234 4.0513 7.4983 14.9068 25.4434 28.3344 25.6673 3.8417 24.1374 11.2960 0.7226 8.8580 12.6184 4.5475 5.2301 3.1107 1.7289 9.5366 1.4168 1.8388 15.3809 10.0101 9.8270 25.8043 27.3457 21.7499 10.3059 25.3053 6.8459 8.2314 20.4641 23.0661 12.4893 6.6165 11.7162 40.1560
temp: 298.150 k
press: 1.00000 atm
elementType: 53 53 8 6 6 6 6 6 6 6 6 1 1 1 1 1 1 1 1 1 1 1 1
symmnumber: 1
zpe: 489971.3 jmol-1
zpe.correction: 0.186620 hartree
zpe.thermalcorrener: 0.197438 hartree
zpe.thermalcorrenthalpy: 0.198382 hartree
zpe.thermalcorrgfe: 0.146598 hartree
zpe.sumelectzpe: -409.412369 hartree
zpe.sumelectthermal: -409.401551 hartree
zpe.sumelectthermalent: -409.400607 hartree
zpe.sumelectthermalfe: -409.452391 hartree
dipole: -0.1429 3.6057 2.8522
dipole: 4.5996
quadrupole: -106.4384 -88.0644 -95.3122
quadrupole: -0.7962 -2.6956 1.4226
quadrupole: -9.8334 8.5406 1.2928 -0.7962 -2.6956 1.4226
hfenergy: -409.598989 hartree
pointgroup: C01 [X(C8H12I2O1)]
dipole: 0.5264521 -1.2238172 1.2247108 debye
dipolederiv: -0.2041704 -0.1142385 0.1214638 -0.1772935 -0.318653 0.1576425 0.1734795 0.1561288 -0.2675291 -0.6519113 0.0980836 0.0367125 0.1390712 -0.1709318 -0.0200217 -0.0221051 -0.0060267 -0.1139911 -0.903174 -0.0444361 0.0851455 0.03801 -0.5208359 -0.0163987 0.1117117 -0.1106127 -0.3933608 0.62331 0.0079739 0.0135165 -0.1436465 0.259509 0.0641555 0.3661074 0.2857749 0.0636493 0.376479 0.0368113 -0.0701097 -0.0238898 0.3588873 -0.0224296 -0.4558163 0.1154714 0.312103 -0.0751743 -0.1355674 -0.0022706 -0.0681547 -0.069593 0.1218909 -0.0981556 -0.0430004 0.0963342 0.0491572 0.0850407 -0.0575683 0.0119263 -0.064363 0.0711611 0.0820972 0.0742479 0.0657871 0.223909 0.2338462 -0.2463375 0.3768469 0.4431523 -0.3872271 -0.4564198 -0.4095761 0.4074595 0.9657974 -0.1943644 -0.0004856 -0.1437551 0.0512115 -0.0311055 0.1291572 -0.0334249 0.0316759 0.0518378 -0.0084393 0.0052025 -0.3524771 -0.0759997 0.0710296 0.1226907 0.0087779 -0.0273012 -0.206305 -0.0121248 -0.0246773 0.1881434 0.0356095 0.020425 -0.0638287 -0.0079178 0.0437265 -0.0821554 0.0490844 0.0613842 0.0579675 0.0269696 -0.0336638 0.0663595 -0.0501642 -0.0120121 -0.0537753 -0.0126653 -0.0459885 0.0113001 0.0580502 -0.0054592 -0.0446991 -0.0235693 0.0078006 0.0623401 -0.0228133 -0.0072206 -0.010073 0.1011242 -0.1006394 -0.0451276 -0.0553125 -0.1146038 -0.0220461 0.0982794 0.0010074 0.0867704 -0.0928664 0.0160568 0.0284244 -0.0257237 0.08114 0.0237738 0.0122988 -0.0021677 0.0174281 -0.0607367 -0.0912712 -0.0331223 -0.1367151 -0.0170038 -0.0201196 -0.0815529 0.0882675 -0.0503419 0.0685728 0.0286144 0.1014291 0.0801491 -0.0423386 -0.1040338 -0.0029921 0.0071253 0.0079093 -0.0401012 0.0916849 -0.0219305 0.0743867 -0.0411191 -0.1020016 0.0733901 -0.0727598 0.0240389 -0.0144534 0.0690538 0.0214263 0.0505466 -0.0665511 -0.0560789 -0.0556476 -0.0425129 -0.0506778 -0.0412848 -0.0907884 -0.0671428 -0.0551816 0.084448 0.0052128 -0.0346214 0.1128102 0.0633672 0.018801 0.1244863 0.0738338 0.137421 -0.0896162 0.0106697 0.0470232 0.0528471 0.0420989 -0.017357 -0.0832656 0.0580498 -0.10383 -0.002284 0.0884589 -0.0223685 -0.013384 -0.0445688 0.0652887 0.0460694 -0.026419 0.0781506 -0.0064135 unknown
polarizability: 171.3038038|4.560474|122.2768128|-15.7984591|-14.0725861|99.2059852 unknown
InChI: InChI=1S/C8H12I2O/c9-5-1-2-6(10)8-4-3-7(5)11-8/h5-8H,1-4H2
charge 0 multiplicity 1
23 atoms
I  2.619685 1.898682 -1.150966
I  -3.632655 0.860165 0.409268
O  0.057878 -0.414896 -1.240199
C  1.254034 -0.811324 -0.457871
C  -1.131157 -0.838119 -0.471697
C  0.7904 -1.975704 0.487267
C  -0.700521 -2.210319 0.101907
C  1.818331 0.395707 0.319196
C  -1.487538 0.196265 0.649956
C  0.836957 1.089858 1.284357
C  -0.572989 1.434369 0.723373
H  1.995207 -1.158211 -1.196959
H  -1.9396 -0.913765 -1.212793
H  0.88339 -1.690515 1.550863
H  1.402189 -2.87913 0.33295
H  -0.773098 -2.968434 -0.696463
H  -1.320207 -2.539075 0.95371
H  2.741484 0.102403 0.85036
H  -1.537622 -0.296297 1.637766
H  1.307712 2.018933 1.651805
H  0.719273 0.438344 2.178234
H  -1.033054 2.170315 1.406257
H  -0.484199 1.904348 -0.270718
