program: Gaussian 09
title: 000296688
version: EM64L-G09RevD.01
frameworkgroup: C1[X(C23H21NO)]
method: RPBEPBE
basis: SDD
operation: Freq
keyword: #p
keyword: freq=noraman
keyword: PBEPBE/SDD
title: #p freq=noraman PBEPBE/SDD
converged: YES YES NO NO
title: Mulliken charges:
elementType: O N C C C C C C C C C C C C C C C C C C C C C C C H H H H H H H H H H H H H H H H H H H H H
charge: -0.223829 -0.166065 -0.262949 -0.269195 -0.512739 0.459645 0.095224 0.417020 -0.368621 -0.421147 0.318928 -0.243723 -0.237247 -0.403624 -0.392634 -0.339195 -0.354880 -0.239749 -0.226968 -0.239028 -0.401118 -0.384455 0.438859 -0.243247 -0.805575 0.227842 0.263719 0.181131 0.257014 0.291213 0.223848 0.228048 0.223310 0.223993 0.301880 0.242868 0.273576 0.226919 0.222832 0.228085 0.232109 0.234413 0.225729 0.229474 0.227124 0.241185
chargesum: 0.00000
title: Mulliken charges with hydrogens summed into heavy atoms:
elementType: O N C C C C C C C C C C C C C C C C C C C C C C C
charge: -0.223829 -0.166065 -0.035106 -0.005476 -0.074595 0.459645 0.095224 0.417020 -0.077408 -0.197299 0.318928 -0.015675 -0.013937 -0.179630 -0.090754 -0.096327 -0.081304 -0.012830 -0.004136 -0.010943 -0.169009 -0.150042 0.438859 -0.017518 -0.107793
polarizability: 2.92052277e+02 1.23707703e+01 2.44839585e+02 -5.59050504e+00 -1.02861010e+01 2.30826313e+02
1716.lowfreq: -31.5197 -6.0675 -1.2210 0.0001 0.0004 0.0005 1.1727 13.5025 25.3420
frequency: -31.4610 13.4843 25.2536 35.5998 38.7303 45.3586 52.7267 75.0101 92.7947 107.3371 125.8665 170.6387 181.0723 210.4826 235.2013 258.0344 267.0804 310.3330 341.9783 365.9668 382.4386 404.5578 405.4157 406.7313 433.8800 454.0656 465.2983 489.2739 538.5696 578.2329 595.5054 604.1034 615.7166 617.1264 632.7229 669.3344 705.7190 706.9482 712.0246 738.9526 747.6422 760.9954 787.2421 794.8625 811.2666 832.0952 852.0498 857.7074 859.8096 861.4145 898.5196 915.3776 930.6042 944.4153 966.7709 980.4369 981.8458 988.0288 988.3426 989.2878 993.6296 996.1781 1001.0309 1010.1239 1016.9382 1026.7677 1027.2441 1046.4127 1047.8235 1058.2850 1072.4761 1083.2097 1089.0197 1123.8119 1171.4021 1171.7136 1183.8187 1186.9912 1188.8474 1190.7206 1210.3142 1224.1292 1226.0043 1236.0688 1251.5530 1300.8330 1308.6996 1322.4651 1341.1591 1363.0861 1374.0407 1382.9386 1385.8466 1397.8968 1404.2999 1412.5513 1439.7106 1447.6065 1461.8095 1468.9976 1473.1262 1485.2090 1486.7425 1503.2272 1555.8785 1587.3366 1590.7340 1593.4341 1615.6044 1616.7307 1620.9658 2863.1435 2977.1548 3003.3383 3014.0625 3034.4687 3058.9570 3089.2370 3106.3869 3109.4070 3122.4233 3124.1626 3126.1062 3126.7648 3136.8245 3140.4437 3148.8468 3149.0649 3156.6599 3158.1831 3161.4685 3169.0152
redmass: 1.0162 5.2986 5.2198 3.8376 3.9326 4.1976 4.4116 5.4426 4.7711 5.1981 4.9260 4.5519 4.8379 4.6594 4.1792 4.1640 3.9421 3.7028 3.6111 4.3511 4.4054 2.8810 2.8717 2.8578 4.8509 3.9281 2.9905 3.2999 3.6078 5.0030 5.2264 5.1302 6.3557 6.2395 6.8643 5.1212 2.4052 1.7829 3.6080 1.3694 2.8935 2.1661 4.0084 3.7681 3.9057 1.8018 2.1480 1.3931 1.2983 1.6103 3.7314 1.3428 1.5151 2.5539 1.3767 1.3841 1.4232 1.4830 3.9857 5.0540 1.8020 1.4396 1.3449 2.6126 1.6337 2.1999 2.1629 1.7730 2.7984 1.7108 1.3098 1.5624 1.6650 1.3076 1.0526 1.0553 1.7233 1.2434 1.2278 1.1334 1.9920 2.6050 1.5553 2.7731 1.4873 1.6246 1.3021 1.4117 1.3309 2.0706 4.1802 4.3223 5.9341 1.2226 2.5015 3.3397 2.1712 2.0137 1.1382 1.1048 1.0579 2.3130 2.3936 2.6404 7.6687 7.5197 6.0367 6.0891 6.0041 5.9392 6.4107 1.0699 1.0390 1.0873 1.0844 1.0873 1.0944 1.1000 1.0876 1.0876 1.0879 1.0864 1.0891 1.0869 1.0920 1.0926 1.0954 1.0956 1.0969 1.0957 1.1014 1.0985
irintensity: 0.6079 0.6131 0.0505 0.1168 0.1171 0.0753 0.6896 1.2752 2.1353 0.8461 5.0495 1.5327 1.7107 2.3847 0.6720 3.5672 2.1501 1.8969 2.2767 2.4644 0.5026 0.1133 0.1729 0.0480 2.2543 0.7742 18.5323 15.9261 12.3539 28.3168 1.8079 1.8216 0.6686 0.2411 0.6004 20.1908 18.5804 66.0648 4.1367 72.7329 15.2660 33.8675 11.6300 6.1448 18.3538 29.5144 10.5627 0.5800 2.8416 5.2167 1.0857 5.8188 5.8503 3.7694 1.0381 0.6325 0.3903 0.3816 0.3899 0.0948 4.9825 4.1827 1.2670 18.5500 4.8957 24.3394 14.6505 54.0942 43.8955 8.4411 8.0091 1.4060 11.1017 11.4796 0.0500 0.0496 22.7193 12.7101 56.3481 8.8870 2.6508 6.6105 4.3439 191.6959 10.8786 44.1536 3.3537 8.0584 12.9391 20.2041 10.3550 29.5280 8.1326 14.4476 22.8189 23.1731 15.3792 21.5766 7.2457 15.5171 12.5712 29.3437 3.6037 0.6524 101.8930 46.6311 0.8690 1.7420 10.8213 5.1927 53.2540 63.2617 27.1232 16.3416 18.7449 27.2846 21.0244 15.5259 10.5673 10.3150 13.5800 2.5954 19.4880 1.9509 30.0664 29.7309 20.2527 5.5592 26.9289 5.0272 40.4421 14.1311
temp: 298.150 k
press: 1.00000 atm
elementType: 8 7 6 6 6 6 6 6 6 6 6 6 6 6 6 6 6 6 6 6 6 6 6 6 6 1 1 1 1 1 1 1 1 1 1 1 1 1 1 1 1 1 1 1 1 1
symmnumber: 1
zpe: 972622.9 jmol-1
zpe.correction: 0.370452 hartree
zpe.thermalcorrener: 0.391651 hartree
zpe.thermalcorrenthalpy: 0.392595 hartree
zpe.thermalcorrgfe: 0.316902 hartree
zpe.sumelectzpe: -1017.234380 hartree
zpe.sumelectthermal: -1017.213182 hartree
zpe.sumelectthermalent: -1017.212238 hartree
zpe.sumelectthermalfe: -1017.287931 hartree
dipole: 2.6187 -1.2777 -3.6892
dipole: 4.7011
quadrupole: -131.4197 -139.8569 -135.2713
quadrupole: -3.1017 2.1435 -3.2211
quadrupole: 4.0963 -4.3409 0.2447 -3.1017 2.1435 -3.2211
hfenergy: -1017.604833 hartree
pointgroup: C01 [X(C23H21N1O1)]
dipole: 1.1644613 0.7697322 1.2134053 debye
polarizability: 290.9827612|-15.0523471|240.8472664|4.2427217|-12.0662744|235.8881466 unknown
InChI: InChI=1S/C23H21NO/c1-17-12-14-20(15-13-17)23(25)22-21(19-10-6-3-7-11-19)24(22)16-18-8-4-2-5-9-18/h2-15,21-22H,16H2,1H3
charge 0 multiplicity 1
46 atoms
O  -0.061178 -0.120329 -1.747758
N  -1.428188 -0.852159 0.700122
C  -0.205715 -1.259949 1.446032
C  -0.279627 0.092642 0.660234
C  -2.615406 -0.440602 1.488027
C  0.574456 -2.453531 0.998129
C  0.416884 0.324475 -0.66141
C  -3.546162 0.460387 0.680934
C  0.350967 -3.053255 -0.268701
C  1.559001 -2.999876 1.861811
C  1.695369 1.104463 -0.636496
C  1.105005 -4.180688 -0.65868
C  2.314323 -4.125591 1.467564
C  -4.57037 1.178642 1.348726
C  -3.423911 0.577994 -0.726022
C  2.387582 1.403042 0.567724
C  2.249138 1.545395 -1.868767
C  2.089238 -4.719307 0.203787
C  -5.467398 1.994398 0.624511
C  -4.319715 1.399263 -1.449128
C  3.598943 2.123159 0.535442
C  3.453892 2.269607 -1.893866
C  4.15362 2.569445 -0.692612
C  -5.34422 2.107522 -0.780487
C  5.471272 3.320701 -0.726683
H  -0.216375 -1.106637 2.540292
H  -0.330266 0.978686 1.315558
H  -2.330887 0.078197 2.43803
H  -3.142666 -1.371277 1.776027
H  -0.418132 -2.628582 -0.921581
H  1.73162 -2.544554 2.845813
H  0.925212 -4.640276 -1.637007
H  3.070473 -4.541223 2.143229
H  -4.668539 1.100082 2.439707
H  -2.628337 0.028508 -1.240947
H  1.993348 1.055989 1.528959
H  1.710479 1.304096 -2.79131
H  2.671872 -5.595182 -0.103518
H  -6.255781 2.542486 1.153225
H  -4.214226 1.484699 -2.536709
H  4.125698 2.34193 1.472114
H  3.863973 2.6097 -2.852476
H  -6.036863 2.742324 -1.344803
H  5.500923 4.049065 -1.555973
H  5.654779 3.863872 0.216611
H  6.318094 2.622247 -0.874781
