program: Gaussian 09
title: 000296653
version: EM64L-G09RevD.01
frameworkgroup: C1[X(C12H12O2)]
method: RPBEPBE
basis: SDD
operation: Freq
keyword: #pfreq=noraman
keyword: PBEPBE/SDD
title: #p freq=noraman PBEPBE/SDD
converged: YES YES NO NO
title: Mulliken charges:
elementType: O O C C C C C C C C C C C C H H H H H H H H H H H H
charge: -0.285235 -0.230604 -0.001664 -0.508394 0.282452 0.173111 -0.707702 -0.450322 0.304425 -0.360363 -0.363846 -0.237052 -0.225055 -0.231983 0.230609 0.242020 0.239802 0.228302 0.235678 0.216712 0.246577 0.238312 0.267045 0.232484 0.231062 0.233632
chargesum: 0.00000
title: Mulliken charges with hydrogens summed into heavy atoms:
elementType: O O C C C C C C C C C C C C
charge: -0.285235 -0.230604 0.228945 -0.026572 0.282452 0.173111 -0.027010 -0.203746 0.304425 -0.122051 -0.096801 -0.004569 0.006007 0.001649
polarizability: 2.16465467e+02 1.72133729e+01 1.46789500e+02 1.80221516e+00 -2.18562667e+00 6.80480527e+01
1716.lowfreq: -3.0713 -0.0004 0.0006 0.0009 5.3096 11.2508 36.1497 77.8316 115.0615
frequency: 36.1270 77.8295 115.0589 122.7502 148.5542 201.5077 213.7875 255.3738 304.4044 347.0868 401.0037 431.9893 441.4469 451.5857 482.7597 524.6621 596.2667 615.3399 645.0914 659.2370 695.5578 778.3032 799.7289 834.3759 846.4899 856.4161 867.2177 912.7441 937.1440 940.3566 986.2674 989.6231 1003.9430 1012.0524 1028.6527 1039.9350 1086.2717 1105.9343 1149.5207 1175.2020 1187.0017 1193.1939 1247.1165 1258.1466 1265.4847 1296.0398 1324.5377 1347.9195 1357.7328 1387.9006 1396.6822 1427.8099 1438.5600 1461.9767 1476.0379 1480.7919 1568.7239 1584.6968 1593.1030 1613.0520 2971.2851 2993.1351 2995.5220 3075.6854 3095.7128 3100.5463 3130.6685 3140.8035 3153.7527 3165.4646 3176.8649 3182.9869
redmass: 3.8562 4.5438 4.8411 2.9579 3.6838 1.3670 2.4290 3.7736 4.3546 5.0326 2.8070 2.9350 4.9881 5.2856 2.5310 4.2112 3.3921 6.3845 5.9841 4.0767 1.7325 2.0144 3.7011 1.4137 3.1412 1.4720 2.5739 1.7944 2.2369 1.4514 1.4508 5.1241 1.3331 4.3085 2.0919 1.8399 1.5830 2.0851 1.8629 1.0568 1.4134 1.1460 1.6283 2.0020 1.6192 2.4798 1.3705 1.7002 1.8578 8.2425 1.2652 1.0955 2.3135 1.0475 1.0807 2.1898 8.2080 6.9653 7.0600 6.0757 1.0835 1.0627 1.0384 1.0974 1.0991 1.1007 1.0851 1.0886 1.0936 1.0975 1.0981 1.0914
irintensity: 0.6910 0.7266 2.3263 3.7178 3.1149 0.3643 0.2508 0.5003 0.0700 9.1064 0.0324 3.2578 0.8275 1.8954 2.0331 8.7720 4.1655 0.0696 4.4492 11.7879 50.6815 57.9346 24.0160 20.0691 1.9792 3.0076 20.4434 3.5280 12.8452 4.0964 0.5151 1.0360 0.6515 68.2478 12.5384 6.6780 16.5472 8.6780 4.1013 1.1957 12.2225 16.3837 35.3530 20.3801 21.1765 232.8131 44.6840 51.9760 14.4416 12.3221 24.5437 13.6404 28.3540 13.3023 18.1559 13.2978 2.3412 363.8503 203.2718 3.2427 18.4672 14.1191 19.7831 7.9577 21.9902 26.6351 0.4842 6.9663 24.0349 21.1399 10.5317 4.5409
temp: 298.150 k
press: 1.00000 atm
elementType: 8 8 6 6 6 6 6 6 6 6 6 6 6 6 1 1 1 1 1 1 1 1 1 1 1 1
symmnumber: 1
zpe: 545536.2 jmol-1
zpe.correction: 0.207784 hartree
zpe.thermalcorrener: 0.219962 hartree
zpe.thermalcorrenthalpy: 0.220907 hartree
zpe.thermalcorrgfe: 0.168853 hartree
zpe.sumelectzpe: -613.910296 hartree
zpe.sumelectthermal: -613.898118 hartree
zpe.sumelectthermalent: -613.897173 hartree
zpe.sumelectthermalfe: -613.949226 hartree
dipole: 2.3462 3.6219 -0.0134
dipole: 4.3154
quadrupole: -75.4441 -84.9170 -84.5235
quadrupole: -15.7419 -0.3538 -2.6793
quadrupole: 6.1841 -3.2888 -2.8953 -15.7419 -0.3538 -2.6793
hfenergy: -614.1180799 hartree
pointgroup: C01[X(C12H12O2)]
dipole: -0.9505336 -1.4057224 -0.0543654 debye
dipolederiv: -0.9266299 0.5981205 -0.0026432 0.2873455 -1.0463341 -0.0049536 -0.007015 0.1058757 -0.2550779 -1.0144441 -0.3630971 -0.0095639 -0.4924788 -0.9168815 0.0327468 -0.0017237 0.0463903 -0.3538808 0.6721282 -0.4469778 -0.0477402 -0.1625588 0.431704 0.0309444 -0.081454 0.0624056 0.365718 -0.1394492 0.1763705 -0.0630953 0.1357739 -0.3609736 0.0657043 -0.0698416 0.0497426 0.0514896 1.2967826 -0.074201 0.0106214 0.0773427 1.1445488 -0.0380235 0.0169212 -0.1394027 0.1093886 1.7750623 0.5212981 0.1086864 0.1365762 0.9150985 -0.1396742 0.1603177 -0.1263043 0.1839066 0.0153129 0.0677236 -0.0115901 0.0983804 -0.1292701 0.024123 -0.0005524 0.0131413 0.0658697 -1.3359611 -0.5340827 -0.0078179 -0.2222514 -0.3668492 -0.0289277 -0.0567067 0.0185071 -0.2538267 -0.3408933 0.0604523 -0.0133107 0.0779674 -0.0594171 -0.0000172 -0.039544 -0.0397606 0.0008365 -0.0010898 0.0718113 0.0257047 -0.1071961 0.010023 0.0389061 0.0113611 0.0362212 -0.1212938 0.0452467 -0.0961693 -0.0171675 0.0775148 -0.0056144 0.0266491 -0.0001624 0.0183946 -0.1230593 -0.0857402 -0.1231268 -0.0267473 -0.1916228 0.0484236 0.0423409 -0.0461978 0.0341604 -0.1404348 -0.1246639 0.1235892 0.0226023 0.2082753 0.1004729 0.0367436 0.03413 0.0405716 -0.1450783 0.0713375 -0.009332 -0.0018069 -0.0047604 -0.0220969 0.0209446 -0.0058972 0.0238279 -0.142844 -0.0457695 0.073014 -0.0316374 -0.0230189 0.0291187 0.0547071 0.0205506 -0.0142953 -0.1557865 -0.093261 0.0313042 0.0427641 0.0002722 0.0953595 -0.00661 0.0736208 -0.0100053 0.0919794 0.1026579 -0.02438 0.0231863 0.0264442 0.0498634 0.0326928 -0.025485 0.0011663 -0.086745 0.1069244 -0.0181529 0.0212403 0.0086202 0.0738616 -0.0175727 -0.0079768 0.0464963 -0.1267896 0.0481104 -0.1317773 -0.0668822 -0.0446481 -0.0393905 -0.0534078 -0.06589 -0.059395 0.050462 -0.1168802 0.0642927 0.0647442 0.004057 0.0773781 0.0101582 0.0640412 0.001825 0.0832888 0.0216923 0.065594 -0.0289299 0.1133334 0.0076336 0.0280854 -0.0069615 0.0253611 0.1592109 0.0706918 -0.0938213 -0.0183818 -0.0664885 -0.0221649 -0.0360823 -0.015543 -0.0246216 0.1386604 0.1077231 0.0729686 0.0186736 0.0713003 0.0058833 -0.0303877 0.0341367 -0.0224026 0.1446418 0.0046952 0.0794013 0.0169036 0.110948 -0.04508 -0.0403586 0.0204724 -0.0412417 0.1509992 0.0193789 -0.0792737 -0.0110364 -0.108269 -0.0703536 -0.0372516 -0.0124025 -0.037946 0.1505032 -0.1329619 -0.0115485 0.0032238 -0.0108589 0.0950569 -0.0114794 0.007802 -0.0087119 0.1578618 unknown
polarizability: 217.1273116|15.8374448|145.9387165|-0.1240163|4.6528381|68.2369908 unknown
InChI: InChI=1S/C12H12O2/c1-9-7-11(13)8-12(14-9)10-5-3-2-4-6-10/h2-6,8-9H,7H2,1H3
charge 0 multiplicity 1
26 atoms
O  0.84815 -1.119716 0.085382
O  3.174171 2.35474 -0.040656
C  2.306767 -1.204483 -0.286473
C  3.084701 -0.06302 0.381399
C  0.260321 0.138425 -0.037089
C  2.467714 1.299588 0.025756
C  2.755858 -2.607116 0.110569
C  1.018549 1.291877 -0.161669
C  -1.219252 0.079362 -0.013477
C  -1.997255 1.249218 0.212929
C  -1.885845 -1.161865 -0.209226
C  -3.404352 1.180223 0.223113
C  -3.294214 -1.227731 -0.194047
C  -4.059786 -0.057693 0.018306
H  2.336566 -1.073901 -1.389367
H  4.141452 -0.075011 0.062268
H  3.06738 -0.184797 1.483201
H  2.693229 -2.740664 1.204545
H  2.124395 -3.372273 -0.372459
H  3.802143 -2.77053 -0.203527
H  0.534137 2.252208 -0.351573
H  -1.503906 2.208359 0.400859
H  -1.286829 -2.061941 -0.372833
H  -3.99089 2.088192 0.400051
H  -3.795123 -2.189558 -0.348782
H  -5.154082 -0.108892 0.030001
