program: Gaussian 09
title: 000296651
version: EM64L-G09RevD.01
frameworkgroup: C1[X(C11H12O)]
method: RPBEPBE
basis: SDD
operation: Freq
keyword: #pfreq=noraman
keyword: PBEPBE/SDD
title: #p freq=noraman PBEPBE/SDD
converged: YES YES NO NO
title: Mulliken charges:
elementType: O C C C C C C C C C C C H H H H H H H H H H H H
charge: -0.443700 -0.245981 -0.499466 0.278723 -0.473343 -0.376440 0.319603 -0.379980 -0.384524 -0.236712 -0.243753 -0.241218 0.247003 0.240524 0.229593 0.224685 0.224912 0.235457 0.334521 0.225048 0.288727 0.223538 0.225002 0.227782
chargesum: 0.00000
title: Mulliken charges with hydrogens summed into heavy atoms:
elementType: O C C C C C C C C C C C
charge: -0.109179 0.001021 -0.029349 0.278723 -0.023746 -0.140982 0.319603 -0.154933 -0.095797 -0.013174 -0.018751 -0.013436
polarizability: 1.75199958e+02 1.30985993e+01 1.22199686e+02 2.29060011e+00 4.07557470e+00 6.68563202e+01
1716.lowfreq: -17.4571 -10.8859 -0.0009 -0.0004 -0.0004 5.0932 46.0837 89.4856 112.2293
frequency: 45.8440 89.4393 112.2220 138.9117 234.9679 260.2700 299.6982 341.3221 372.0367 402.5413 425.6925 500.7003 614.0605 630.2898 658.3496 696.6896 708.3959 748.5247 777.0829 822.1895 839.3747 853.1920 890.9832 920.6089 932.4108 975.2203 979.9891 981.1162 991.1231 997.2535 1028.1681 1036.7276 1072.5176 1083.8674 1129.4695 1173.0846 1174.6157 1195.4850 1214.5104 1238.6429 1257.7126 1294.2827 1296.2571 1313.6857 1336.7445 1371.8893 1378.2770 1437.7053 1454.8507 1470.3621 1486.7185 1580.0923 1612.3133 1631.9479 2969.8236 3011.0107 3024.4603 3059.9079 3084.7730 3120.8783 3128.6563 3141.0994 3145.2570 3153.2261 3164.7745 3544.0176
redmass: 3.7820 3.1479 3.0272 4.0593 2.4872 3.5021 3.8655 1.1866 4.1542 2.8032 3.1068 3.3525 6.0855 4.2145 5.7931 1.8408 2.3194 2.2224 1.8863 1.9698 2.1869 1.2793 2.2702 2.0752 1.7925 2.4606 1.6850 2.4705 3.6130 1.4013 2.0412 2.0355 1.8286 1.6085 1.1465 1.0596 1.3957 1.1232 1.4418 1.3372 1.4499 1.6153 2.3054 1.5311 1.6611 1.2058 5.5258 2.3414 1.0824 1.0977 2.3138 5.7422 5.9549 7.1012 1.0636 1.0758 1.0843 1.0869 1.1019 1.0846 1.0878 1.0937 1.0943 1.0956 1.1012 1.0661
irintensity: 0.4638 2.1989 1.2335 1.0124 1.7194 2.0226 1.8169 129.4792 0.0984 0.3841 10.6208 14.8980 0.0895 1.7528 3.8956 24.1053 24.1473 21.2294 63.8437 46.2437 1.6229 0.6781 12.2654 17.8245 21.3482 2.5876 2.7511 13.3710 1.8955 0.9878 19.7316 25.8846 10.2051 7.1001 18.5525 0.2036 5.9945 1.2851 12.6852 0.4862 1.6593 5.5813 0.2902 9.2656 5.1787 27.1184 3.4691 5.8053 6.1127 15.6333 18.3164 2.6169 4.3175 2.7998 49.5105 13.6260 38.0118 24.6585 29.0976 3.4374 5.2109 21.4009 18.5431 21.7844 25.2342 4.5576
temp: 298.150 k
press: 1.00000 atm
elementType: 8 6 6 6 6 6 6 6 6 6 6 6 1 1 1 1 1 1 1 1 1 1 1 1
symmnumber: 1
zpe: 520724.3 jmol-1
zpe.correction: 0.198333 hartree
zpe.thermalcorrener: 0.208779 hartree
zpe.thermalcorrenthalpy: 0.209723 hartree
zpe.thermalcorrgfe: 0.161872 hartree
zpe.sumelectzpe: -500.705091 hartree
zpe.sumelectthermal: -500.694646 hartree
zpe.sumelectthermalent: -500.693702 hartree
zpe.sumelectthermalfe: -500.741552 hartree
dipole: -0.6885 -1.9368 -0.3154
dipole: 2.0796
quadrupole: -62.5499 -70.8071 -71.6278
quadrupole: 3.7839 0.8215 0.9852
quadrupole: 5.7784 -2.4788 -3.2996 3.7839 0.8215 0.9852
hfenergy: -500.9034243 hartree
pointgroup: C01 [X(C11H12O1)]
dipole: -0.2742073 0.7567195 0.1468844 debye
dipolederiv: -0.654124 -0.1649749 -0.0738435 -0.0748406 -0.6286472 0.2619724 -0.0607561 0.3383885 -0.3966508 0.3193859 0.0878993 0.0646045 0.0150537 0.4882864 -0.1569272 0.0695524 -0.1941842 0.5089836 -0.1155136 0.107456 -0.0520837 0.0375312 -0.0211351 -0.0070687 0.0250946 0.0140813 0.0594774 0.1494079 -0.074669 -0.0326072 0.109096 -0.0820651 0.1006056 0.0543987 -0.0141108 -0.1394833 -0.113424 0.0070671 -0.0325836 0.0889591 0.0293739 -0.0801169 0.0193258 -0.0855183 0.1487446 0.0935514 -0.0613679 0.0360235 0.0047494 -0.0165518 0.1102933 0.024186 0.0997345 -0.1830911 0.2672968 -0.0414665 -0.0272347 -0.1365656 -0.0153044 -0.0260693 -0.0919388 -0.000352 0.0272165 -0.1506621 -0.0447012 0.0122202 -0.0518445 0.0368101 -0.0070682 0.0331404 -0.0049482 -0.1563778 -0.1346361 0.0706077 0.0062109 0.1087839 -0.0199522 0.0011862 -0.0365493 -0.0135102 -0.1576039 -0.0081519 0.084188 0.0022081 0.1399002 0.0678657 0.0032812 0.0030214 0.0108156 -0.1516064 0.001671 -0.081277 -0.0026041 -0.1332914 0.1245546 0.0172989 0.0223109 0.007713 -0.1565519 0.0086477 0.0003352 0.0031487 -0.0338583 -0.0618432 0.004875 -0.0058514 0.001892 -0.1696632 0.0535853 0.0438622 0.0600202 0.0293966 -0.0356795 -0.0753522 0.0455018 -0.038061 -0.0773003 -0.066446 -0.0907278 0.0291847 -0.1191987 -0.0088026 0.01884 0.0629459 0.0355733 0.0722838 0.074036 0.0168426 -0.030113 0.0373886 0.0482409 0.0468979 -0.0856588 0.0144705 -0.146435 -0.0643537 0.0313397 0.0949376 -0.0748311 0.086085 0.0027317 0.1224654 -0.0363962 -0.1075059 -0.0445471 0.0914757 -0.0387148 0.0644699 -0.0574802 0.0671413 -0.1264734 0.1071421 0.0452811 0.0117653 -0.0911814 -0.0525291 -0.0981864 -0.0227676 -0.0840733 -0.0516975 -0.0877623 0.1200289 0.3424046 0.0666536 0.0438257 0.0842934 0.2008491 -0.169757 0.0040656 -0.129009 0.0969076 0.0540556 0.1033065 -0.0031574 0.0678717 -0.0645562 -0.0007781 -0.0100816 -0.0059984 0.1408327 0.1036978 -0.0651899 -0.010711 -0.0670343 0.0189947 -0.006016 -0.0161038 -0.0024865 0.1500322 -0.0103319 -0.0952103 -0.0040353 -0.1221791 -0.0602615 -0.0069295 -0.005696 -0.0042836 0.1560489 0.0288374 0.0781472 0.0053287 0.1050788 -0.0950304 -0.0125387 0.0053679 -0.0088758 0.1536251 -0.146152 0.0215852 0.0025046 0.0192573 0.0890164 -0.0024286 -0.0005701 -0.0043143 0.1628071 unknown
polarizability: 175.3142886|-12.8273287|121.7940644|-2.4392772|5.733258|67.147611 unknown
InChI: InChI=1S/C11H12O/c12-11-8-4-7-10(11)9-5-2-1-3-6-9/h1-3,5-7,11-12H,4,8H2
charge 0 multiplicity 1
24 atoms
O  -1.715725 -2.012074 0.507179
C  -1.731505 -0.894859 -0.479475
C  -3.12975 -0.229634 -0.622949
C  -0.808131 0.250504 -0.051514
C  -3.050306 1.117108 0.159799
C  -1.557654 1.329432 0.334913
C  0.66671 0.123185 -0.046697
C  1.509387 1.271292 0.003702
C  1.281277 -1.160416 -0.111975
C  2.912746 1.141459 -0.000203
C  2.686954 -1.288198 -0.121253
C  3.510679 -0.140595 -0.062667
H  -1.405658 -1.397315 -1.405418
H  -3.91936 -0.909164 -0.259781
H  -3.331057 -0.024944 -1.689983
H  -3.56508 1.07538 1.141894
H  -3.52132 1.949488 -0.397534
H  -1.15068 2.254624 0.758089
H  -1.822127 -1.624009 1.414073
H  1.061086 2.271385 0.022584
H  0.6471 -2.052924 -0.127223
H  3.542387 2.037985 0.034276
H  3.140014 -2.285032 -0.168273
H  4.601814 -0.240978 -0.070262
