program: Gaussian 09
title: 000026706
version: EM64L-G09RevD.01
frameworkgroup: C1[X(C7H12Cl2O)]
method: RPBEPBE
basis: SDD
operation: Freq
keyword: #p
keyword: freq=noraman
keyword: PBEPBE/SDD
title: #p freq=noraman PBEPBE/SDD
converged: YES YES NO NO
title: Mulliken charges:
elementType: Cl Cl O C C C C C C C H H H H H H H H H H H H
charge: 0.021618 0.006638 -0.247096 0.000571 -0.315469 -0.460635 -0.247193 -0.081814 -0.690310 -0.699423 0.249741 0.280833 0.270141 0.193291 0.208175 0.213621 0.208155 0.200678 0.245153 0.223355 0.211617 0.208353
chargesum: 0.00000
title: Mulliken charges with hydrogens summed into heavy atoms:
elementType: Cl Cl O C C C C C C C
charge: 0.021618 0.006638 -0.247096 0.250312 -0.315469 0.090339 0.154272 0.131807 -0.036323 -0.056098
polarizability: 1.14355753e+02 -7.31486621e+00 9.08346761e+01 -1.89069823e+00 -6.82862193e-02 8.42017753e+01
1716.lowfreq: -8.5696 -5.8044 -0.0026 -0.0022 0.0018 5.7144 33.5360 42.7398 68.3041
frequency: 33.4788 42.5616 68.2675 114.7848 162.6602 191.6176 205.8065 230.7028 245.3914 268.2297 324.0136 336.3411 398.7613 414.0110 430.9616 482.5833 531.4834 684.8449 789.7166 828.2903 883.4926 911.1966 919.4722 933.4144 958.7624 968.8212 977.1209 1029.6371 1072.9902 1089.5074 1125.5914 1142.0784 1152.0544 1190.5208 1230.0744 1239.5935 1292.3566 1327.9783 1344.3796 1376.7730 1381.4421 1398.6965 1424.7144 1462.8618 1469.3096 1476.5255 1481.7013 1490.3162 2941.5124 2971.2781 2977.8478 2986.5851 3013.2602 3062.8966 3063.8059 3070.9311 3077.4421 3096.7412 3111.0251 3221.4077
redmass: 3.0981 4.4240 6.1580 3.1447 3.2887 1.8643 1.7608 1.2882 4.3473 4.1629 2.9063 3.3724 2.5243 2.7913 4.0811 2.7951 5.5537 3.1632 2.2647 2.3675 3.4346 1.7558 1.2745 1.9874 1.6962 2.1930 2.1445 1.9386 1.3934 1.6340 2.2490 1.8354 1.9532 1.7658 1.3165 1.8894 1.3270 1.5286 1.4674 1.2379 1.3708 1.2332 1.2960 1.0588 1.0459 1.0761 1.0502 1.0569 1.0564 1.0358 1.0381 1.0854 1.1035 1.0995 1.0883 1.0992 1.0988 1.0989 1.0568 1.1159
irintensity: 0.1026 1.0162 0.3790 1.4125 4.1708 1.3303 2.7649 0.2137 0.9930 2.7444 0.6174 0.3776 0.2192 1.9078 13.0243 2.5459 24.2458 75.7868 7.3570 6.1245 5.4647 7.7546 0.7618 39.0042 5.4122 37.1284 12.0556 80.3170 29.0537 42.3728 27.0848 19.5531 16.9798 3.1050 3.5167 19.3474 7.6148 19.6727 3.3248 16.6073 7.7839 19.7564 28.6441 4.1600 1.3154 4.3667 12.9452 28.7715 48.0662 38.2711 22.0304 3.5411 40.9815 25.3695 21.4194 55.3340 61.9752 28.4159 0.8770 0.9616
temp: 298.150 k
press: 1.00000 atm
elementType: 17 17 8 6 6 6 6 6 6 6 1 1 1 1 1 1 1 1 1 1 1 1
symmnumber: 1
zpe: 461343.6 jmol-1
zpe.correction: 0.175716 hartree
zpe.thermalcorrener: 0.187971 hartree
zpe.thermalcorrenthalpy: 0.188916 hartree
zpe.thermalcorrgfe: 0.135796 hartree
zpe.sumelectzpe: -1268.417881 hartree
zpe.sumelectthermal: -1268.405626 hartree
zpe.sumelectthermalent: -1268.404682 hartree
zpe.sumelectthermalfe: -1268.457801 hartree
dipole: -1.3380 -1.6264 0.5638
dipole: 2.1801
quadrupole: -75.0371 -73.9504 -74.7765
quadrupole: -1.1996 5.6424 0.2695
quadrupole: -0.4491 0.6376 -0.1885 -1.1996 5.6424 0.2695
hfenergy: -1268.5935975 hartree
pointgroup: C01 [X(C7H12Cl2O1)]
dipole: -0.5253781 -0.6249069 0.2629984 debye
dipolederiv: -0.2147693 0.1554278 -0.0015085 0.1237014 -0.6146795 0.1431852 -0.0092546 0.1062222 -0.1776018 -0.5346829 0.1435445 0.2985613 0.1976118 -0.2687058 -0.1372678 0.3423031 -0.1047263 -0.4188109 -1.3536859 -0.0760596 -0.0694998 0.068031 -0.3738199 0.0449801 -0.1324237 0.0101168 -0.4170034 0.8484039 0.0616959 -0.0923673 -0.1751748 0.2035515 -0.0866125 -0.1811083 -0.015576 0.2216437 0.6653206 -0.3801978 -0.2148559 -0.372664 0.8403933 0.113097 -0.19606 0.0850894 0.5855257 -0.1794896 -0.0254213 -0.0604083 -0.0329668 -0.0558693 0.0249581 -0.1476898 -0.0006722 -0.3179855 0.7095303 0.0564632 0.1369619 0.1324399 0.3622515 -0.0624147 0.3795848 -0.0018809 0.3448879 0.0671933 0.0076066 -0.0322853 -0.0003291 0.1124634 -0.0057915 -0.0578275 -0.0307117 0.1227759 0.005951 -0.0144396 -0.040668 -0.0165312 -0.0735048 -0.0578699 -0.023866 -0.0604157 0.0490845 -0.0600039 -0.0131729 -0.0644064 0.0260368 0.0565435 -0.0454995 -0.0007258 -0.0336807 0.0394522 -0.0524298 -0.0212317 -0.0051825 0.036593 -0.1075776 -0.0429511 0.06209 -0.0528527 0.0690788 0.0971685 0.0608964 0.0362016 0.0117859 0.0664667 -0.0455221 0.0047993 -0.0522408 0.0549242 0.0195868 0.0473163 -0.0594743 0.0825878 0.0468856 0.0174118 -0.029834 0.0167598 0.0823014 -0.0173436 0.0295769 -0.017255 -0.0310211 -0.2042904 -0.0889363 -0.0664938 -0.0460955 0.0150525 -0.0162794 -0.0234341 0.0442567 -0.0347967 0.007835 0.1088566 -0.0390881 0.0481402 -0.103875 0.0460795 -0.0206234 0.01899 -0.0122528 -0.0252299 0.0916668 0.0481804 0.0879177 -0.1118936 -0.146299 0.1108713 0.1054662 0.0725479 0.0337954 -0.0277635 0.0878073 -0.0365936 0.0660956 0.096815 -0.0343094 0.0468538 -0.01681 0.0095232 0.0596775 0.0426149 0.1211374 -0.1085827 0.0119228 -0.0788608 -0.1232062 -0.0756517 0.063099 -0.0243591 -0.1254282 -0.0402586 -0.0032333 -0.1618875 0.0610077 0.0382595 0.0990837 0.0713563 -0.0264484 0.0660681 -0.0299801 0.059642 0.0957054 0.0009132 -0.0190855 -0.055788 -0.1862609 -0.0673912 -0.0278144 -0.0433451 0.0628969 0.0731938 -0.0475693 0.074652 -0.0264325 0.0357738 0.1149946 0.0041662 0.0736462 -0.114375 unknown
polarizability: 113.2550744|-8.0034201|91.3356868|-4.6198589|0.8027864|84.801443 unknown
InChI: InChI=1S/C7H12Cl2O/c1-5(2)4-10-6-3-7(6,8)9/h5-6H,3-4H2,1-2H3
charge 0 multiplicity 1
22 atoms
Cl 1.54938 1.721745 -0.631362
Cl 3.287812 -0.691223 -1.392788
O  -0.25741 -0.488511 0.771737
C  1.043135 -0.945627 0.436119
C  2.063227 0.011838 -0.196988
C  2.200847 -0.358838 1.268994
C  -1.242648 -0.676476 -0.325122
C  -2.598978 -0.146407 0.163431
C  -2.536995 1.371356 0.447752
C  -3.691578 -0.484067 -0.879044
H  1.114618 -1.99478 0.109361
H  1.926465 0.412755 1.99464
H  3.019375 -1.019238 1.566347
H  -1.303606 -1.758898 -0.571146
H  -0.900953 -0.121007 -1.223111
H  -2.834102 -0.67375 1.10993
H  -3.497357 1.731235 0.860199
H  -2.332697 1.935071 -0.482904
H  -1.735854 1.603316 1.169557
H  -4.676283 -0.117058 -0.538014
H  -3.775933 -1.574086 -1.048527
H  -3.473567 -0.001549 -1.851361
