program: Gaussian 09
title: 000296647
version: EM64L-G09RevD.01
frameworkgroup: C1[X(C9H11N)]
method: RPBEPBE
basis: SDD
operation: Freq
keyword: #pfreq=noraman
keyword: PBEPBE/SDD
title: #p freq=noraman PBEPBE/SDD
converged: NO YES NO NO
title: Mulliken charges:
elementType: N C C C C C C C C C H H H H H H H H H H H
charge: -0.002082 0.388063 -0.605883 -0.361897 -0.361945 -0.230944 -0.230833 -0.236971 -0.154735 -0.705296 0.227880 0.227771 0.234017 0.233953 0.226692 0.226688 0.228290 0.209573 0.221078 0.220917 0.245664
chargesum: 0.00000
title: Mulliken charges with hydrogens summed into heavy atoms:
elementType: N C C C C C C C C C
charge: -0.002082 0.388063 -0.150232 -0.127880 -0.127992 -0.004252 -0.004145 -0.008680 0.054838 -0.017637
polarizability: 1.19327322e+02 1.21436229e+01 8.57136139e+01 -3.60237146e-01 3.35198205e-01 9.35990125e+01
1716.lowfreq: -14.4975 -7.1311 -0.0009 -0.0002 0.0003 11.3293 36.6861 75.6023 108.9330
frequency: 36.1776 75.5955 108.9270 195.2271 219.1518 232.3497 309.1602 324.3224 402.2657 468.7644 509.8904 617.1323 641.7600 705.9079 747.7549 816.6194 845.4299 851.8127 856.5751 923.6996 962.1928 977.3910 989.7587 995.3021 1009.5637 1026.8325 1076.9123 1086.8866 1140.9460 1172.2524 1188.0777 1206.6638 1216.9553 1304.0946 1327.3307 1364.7292 1383.6913 1386.9048 1439.1583 1446.8035 1455.6518 1459.6198 1482.3096 1592.5049 1612.6058 1657.5405 2959.1866 2975.1714 2986.9047 3031.6149 3050.2513 3111.4529 3114.6441 3115.0018 3131.1069 3143.3818 3161.6875
redmass: 3.5017 4.0145 1.4415 1.5513 3.9025 2.9266 3.7543 1.9214 2.8166 3.5628 4.0542 6.3348 3.8264 1.7362 2.3018 2.9148 1.2535 2.7835 1.2485 1.4662 1.5649 1.3878 6.2433 1.3314 2.6317 2.2210 1.6026 1.5467 2.3952 1.0537 1.1250 2.9063 1.1280 1.2711 1.2628 1.2309 8.0154 1.3086 2.1755 1.1120 1.0592 1.0482 2.2411 6.0543 6.0916 6.2000 1.0782 1.0443 1.0605 1.1015 1.0964 1.0993 1.0865 1.0879 1.0907 1.0958 1.1015
irintensity: 0.0360 0.0997 7.5130 1.1657 2.0753 5.0136 4.7787 2.2837 0.0011 9.7462 0.8816 0.1733 18.6726 55.5472 46.1212 1.0415 11.6823 11.3431 0.2493 1.0771 1.5918 0.0126 0.1270 0.1195 7.3146 4.5952 0.2203 10.7483 7.1039 0.0516 0.5309 6.9935 0.1446 8.5283 0.2200 4.0844 0.0112 21.8397 8.4275 4.5433 30.3993 17.6764 9.9795 0.8871 2.7536 48.4818 41.1494 26.0255 31.0668 12.7354 21.6167 18.6629 7.0677 5.1422 7.5940 43.6049 23.3309
temp: 298.150 k
press: 1.00000 atm
elementType: 7 6 6 6 6 6 6 6 6 6 1 1 1 1 1 1 1 1 1 1 1
symmnumber: 1
zpe: 458358.8 jmol-1
zpe.correction: 0.174580 hartree
zpe.thermalcorrener: 0.184226 hartree
zpe.thermalcorrenthalpy: 0.185170 hartree
zpe.thermalcorrgfe: 0.138851 hartree
zpe.sumelectzpe: -403.551246 hartree
zpe.sumelectthermal: -403.541600 hartree
zpe.sumelectthermalent: -403.540656 hartree
zpe.sumelectthermalfe: -403.586974 hartree
dipole: -1.1461 -1.3527 0.0279
dipole: 1.7732
quadrupole: -61.1994 -59.9030 -54.8661
quadrupole: -1.4632 0.0052 0.1447
quadrupole: -2.5432 -1.2468 3.7901 -1.4632 0.0052 0.1447
hfenergy: -403.7258257 hartree
pointgroup: C01 [X(C9H11N1)]
dipole: -0.4036298 -0.1878837 -0.5370859 debye
dipolederiv: -0.4245795 -0.0639794 -0.1795079 0.0313025 -0.3161855 -0.074464 0.1383001 -0.0550135 -0.5069353 0.0337475 0.0379358 0.1084004 0.0601305 -0.0371726 -0.0147527 0.1812199 -0.0101329 -0.1109259 0.27747 0.0143944 0.0329828 0.0365136 0.2343764 0.0207354 0.102815 0.0271768 0.2910146 -0.1398646 0.0608605 0.0341735 0.0374782 0.0765661 -0.0121467 -0.0182619 -0.015993 -0.1203301 -0.1251638 -0.0538514 0.0750032 -0.0636841 0.0160729 -0.0775843 0.0181929 -0.0811596 -0.0744522 -0.0399728 -0.0488779 0.0861725 -0.0547324 0.0398736 -0.0817462 0.0879242 -0.0792692 -0.0484363 -0.057103 0.0704751 0.0431957 0.0760353 0.1073104 -0.0077452 0.0420685 -0.0101195 -0.0985929 -0.0270053 0.04317 0.1304171 0.0368653 -0.0693602 0.0105379 0.1088403 0.0089074 -0.0693298 0.5173308 0.0093197 -0.099557 -0.0405052 -0.0387278 0.147898 -0.2634443 0.1368314 0.4326531 -0.2158907 0.0230907 0.1371953 0.0483239 0.054918 -0.0399726 0.2167281 -0.0338293 -0.0949917 -0.0273924 0.0240369 0.045336 0.0153913 -0.0977645 -0.1253036 -0.0256145 -0.0326782 0.068346 -0.0231345 0.0007284 0.0305017 -0.0279953 0.0240166 0.1591927 -0.0210924 0.0582042 -0.0575439 0.0913455 -0.0906324 -0.0307589 -0.0695717 -0.0841275 0.0020706 -0.0295697 -0.0158065 0.1050024 0.0716847 0.0728385 -0.086999 0.0553023 -0.0042227 0.0694117 -0.0765426 0.0882587 0.0450256 0.0542825 0.0591557 -0.0829922 0.0707982 -0.0212802 0.0933313 -0.0983132 0.089915 0.0655736 0.0748305 -0.0760992 -0.0338845 -0.0943873 -0.1024535 0.004202 -0.040322 0.006164 0.1262406 -0.0295612 -0.0476547 -0.1299742 -0.0501221 0.0780275 -0.0165101 -0.1382194 -0.0170663 0.0610382 -0.0713875 -0.0433718 -0.1000685 -0.0463664 0.1164598 -0.0712996 -0.1090907 -0.0719429 -0.0747047 0.0402957 0.0095493 0.0477056 0.0647541 -0.104878 -0.0907457 0.0292581 -0.0725595 0.0910228 0.0451021 0.0241203 0.0253325 -0.031535 0.0294737 0.1365912 0.0432355 0.1183779 -0.0482077 -0.0250343 -0.0252086 -0.0526739 -0.0539958 0.0990773 -0.0317002 -0.1481119 -0.0382651 0.0185334 unknown
polarizability: 116.9328615|5.8179106|93.7066746|13.6828691|-0.8895016|88.0004124 unknown
InChI: InChI=1S/C9H11N/c1-2-10-8-9-6-4-3-5-7-9/h2-7H,8H2,1H3
charge 0 multiplicity 1
21 atoms
N  2.326721 0.42432 1.004638
C  -0.248122 0.188701 0.80029
C  0.976572 0.527884 1.640264
C  -0.896231 1.1860 0.026629
C  -0.740149 -1.140716 0.740215
C  -2.012729 0.867666 -0.779108
C  -1.856127 -1.465887 -0.063544
C  -2.496789 -0.460817 -0.825616
C  2.455603 0.06034 -0.237974
C  3.817677 -0.044357 -0.878925
H  0.904322 1.565587 2.020131
H  1.017697 -0.122293 2.535791
H  -0.524082 2.218045 0.061004
H  -0.245873 -1.922942 1.330652
H  -2.505943 1.65203 -1.364606
H  -2.227314 -2.496724 -0.092711
H  -3.365203 -0.709296 -1.446252
H  1.590466 -0.190866 -0.888533
H  3.995095 -1.074311 -1.245113
H  3.883515 0.622664 -1.760421
H  4.605395 0.22617 -0.157613
