program: Gaussian 09
title: 000296622
version: EM64L-G09RevD.01
frameworkgroup: C1[X(C11H10N2O3)]
method: RPBEPBE
basis: SDD
operation: Freq
keyword: #p
keyword: freq=noraman
keyword: PBEPBE/SDD
title: #p freq=noraman PBEPBE/SDD
converged: NO YES NO NO
title: Mulliken charges:
elementType: O O O N N C C C C C C C C C C C H H H H H H H H H H
charge: -0.253294 -0.214573 -0.197788 -0.167225 0.017878 0.313153 0.175823 -0.375303 -0.168006 -0.298831 0.131876 -0.513942 -0.318107 0.404607 -0.412011 -0.657408 0.235786 0.227489 0.233204 0.247553 0.332434 0.256605 0.290441 0.242734 0.236008 0.230898
chargesum: 0.00000
title: Mulliken charges with hydrogens summed into heavy atoms:
elementType: O O O N N C C C C C C C C C C C
charge: -0.253294 -0.214573 -0.197788 -0.167225 0.017878 0.313153 0.175823 0.087972 0.065198 -0.051278 0.131876 -0.181509 -0.061502 0.404607 -0.121570 0.052232
polarizability: 2.26417493e+02 -7.67357154e+00 1.76739322e+02 4.77343430e+00 6.95748065e+00 6.64062516e+01
1716.lowfreq: -7.5681 -2.7807 -0.0007 -0.0001 0.0005 7.4479 52.7065 66.0798 74.4853
frequency: 52.6934 66.0726 74.4588 93.9693 155.9878 162.8983 181.3761 209.7171 278.6921 295.5406 302.7106 361.0244 394.1741 420.3632 465.6895 493.0972 501.6931 520.4734 559.7684 569.4903 595.8353 655.5603 696.0495 714.8121 733.3349 749.0308 776.3506 797.3239 828.0909 837.1337 870.1766 944.6608 954.2401 984.2035 989.3840 1006.0683 1049.3627 1084.4108 1102.3836 1127.3063 1153.4441 1174.1397 1212.7854 1223.7823 1250.9934 1259.3601 1279.6304 1342.0820 1362.6055 1383.3545 1395.8257 1398.8100 1412.0277 1454.8100 1469.3195 1474.2659 1483.7215 1507.2841 1557.0205 1567.1046 1608.7185 1638.5930 2995.7352 3022.6940 3071.3301 3094.8389 3103.5264 3156.8679 3168.5330 3169.7210 3189.0054 3191.4161
redmass: 9.8704 4.6615 4.8687 3.5858 6.1589 5.7210 4.3080 1.0959 4.8069 9.2736 5.3790 4.1248 3.4397 3.3807 4.4921 7.7897 4.6804 6.6254 3.5834 3.7998 6.6326 4.5231 5.4861 4.9596 7.3753 5.2230 2.5554 1.1770 1.5237 2.1127 6.4754 2.5102 1.3093 1.3758 1.4003 2.4560 2.3670 2.0711 3.1806 2.0390 1.3150 1.6967 8.0130 2.2885 1.6406 1.7917 1.7342 1.2904 7.1402 1.9686 2.9201 1.2158 5.7953 3.9779 1.1514 2.9018 1.0474 1.1018 7.6298 7.3060 7.2798 7.0040 1.0361 1.0612 1.1028 1.0995 1.1022 1.0893 1.0893 1.0907 1.0966 1.0974
irintensity: 0.1290 0.3798 1.7762 0.1263 1.2085 2.7343 2.5298 0.1519 2.5352 1.8941 1.4750 3.8349 1.1966 6.7570 7.8746 1.5162 3.5836 7.2499 0.1129 5.3776 4.5959 4.5126 0.2681 20.3820 14.7165 0.5758 5.5562 6.3698 1.9076 81.2541 10.8509 2.7114 0.0622 10.9669 7.8566 2.4082 14.6424 5.8747 31.2049 15.9993 19.1886 85.6882 461.7144 57.8309 14.8995 33.9146 10.8284 18.3876 60.0123 60.7603 66.6659 22.5299 10.3846 18.1417 50.7216 85.3379 1.1643 20.9670 103.9870 8.7753 124.8126 235.9907 16.1212 31.9671 1.3500 34.7162 26.3083 8.1708 0.0926 17.8907 6.0449 5.9934
temp: 298.150 k
press: 1.00000 atm
elementType: 8 8 8 7 7 6 6 6 6 6 6 6 6 6 6 6 1 1 1 1 1 1 1 1 1 1
symmnumber: 1
zpe: 510978.6 jmol-1
zpe.correction: 0.194621 hartree
zpe.thermalcorrener: 0.208102 hartree
zpe.thermalcorrenthalpy: 0.209046 hartree
zpe.thermalcorrgfe: 0.153926 hartree
zpe.sumelectzpe: -759.132718 hartree
zpe.sumelectthermal: -759.119237 hartree
zpe.sumelectthermalent: -759.118293 hartree
zpe.sumelectthermalfe: -759.173414 hartree
dipole: -9.5033 -5.6862 -0.8351
dipole: 11.1060
quadrupole: -97.2674 -101.1741 -93.1480
quadrupole: 5.0541 0.4634 -0.4397
quadrupole: -0.0709 -3.9776 4.0485 5.0541 0.4634 -0.4397
hfenergy: -759.3273394 hartree
pointgroup: C01 [X(C11H10N2O3)]
dipole: -3.6291931 -2.4145636 -0.3015894 debye
dipolederiv: -0.4430167 -0.355063 -0.0287807 -0.0689237 -1.1371367 -0.0574384 -0.01185 -0.085346 -0.3613244 -0.857508 0.2583994 -0.0078207 0.3582677 -0.6894331 -0.0206621 -0.0067001 -0.0217893 -0.2385061 -0.8222624 -0.1493966 -0.0393389 -0.3716963 -0.5820509 -0.0449119 -0.0636449 -0.0378674 -0.2272068 -1.2895056 0.3437358 0.0041717 -0.0942831 -0.9551042 0.0134502 -0.1106756 -0.0324407 -0.18315 2.1812838 -0.1797597 0.0797871 0.0375331 1.0151091 0.0684155 0.115619 0.0578377 0.1954268 1.2546916 -0.1111651 0.014634 -0.0020713 -0.0074325 0.0013186 0.0756297 -0.018657 0.0960691 -0.5217221 0.261114 0.001931 -0.2130517 -0.3531532 -0.0269955 -0.0422848 -0.0147265 -0.0297234 0.4029284 0.2710063 -0.0261981 0.4276873 0.5866617 -0.0293273 0.0577551 0.0047451 0.2592641 0.2673597 -0.2951083 0.013688 -0.2031212 1.0794743 0.0561472 0.0036169 0.091132 -0.0580978 -0.5091225 0.0768713 -0.0091686 0.342585 0.0478042 0.0090095 0.0074317 0.0232779 -0.1606933 0.6615564 0.4502548 0.0573433 -0.0317218 1.2258661 0.0784045 0.0285243 0.1166 0.1764103 0.3878068 -0.181383 0.0056453 -0.1791597 0.0211283 0.0008672 0.0136718 -0.0045742 -0.0561799 -0.3022661 -0.5871373 -0.0394729 -0.0959565 -0.3696616 -0.0010647 -0.0070537 -0.0526782 -0.2103327 -0.9510061 0.1718644 -0.0283668 0.0088071 -0.1786678 -0.0159188 -0.0558349 -0.0104839 0.0383942 0.3527404 0.0330272 0.0227323 0.2718355 0.0751275 0.0309267 0.0509654 0.0143512 -0.1037945 -0.0002864 -0.0487777 0.0101245 -0.1070299 -0.0470633 0.0377762 -0.0054819 0.0654513 -0.0704987 0.048856 0.0663272 0.1231553 -0.0403069 -0.051919 -0.0547366 0.06337 -0.03797 -0.0226145 -0.1013392 -0.0196726 -0.0908481 0.0568826 0.0353294 0.0770186 -0.0426518 0.0382716 0.0396344 -0.0833715 -0.0205267 -0.0158448 -0.0693774 0.0988572 -0.0155629 -0.0239394 -0.0080959 0.1473817 0.0434018 -0.0876102 -0.0152389 -0.0799786 -0.0405819 -0.0095853 -0.016947 -0.0162074 0.1470579 0.1376062 0.0030526 -0.0011343 -0.0336953 0.1221971 -0.005608 -0.0058006 -0.0031641 0.1627244 0.024605 0.0428211 -0.0051359 0.075113 0.0172425 -0.0070802 -0.0082266 -0.0107417 0.1722851 0.1108427 0.0632231 0.0029039 0.0167061 0.0675835 -0.0074465 -0.0022978 -0.0036572 0.1676456 -0.0640802 0.0624132 -0.0952735 0.0464371 0.1034613 0.0222796 -0.0635689 -0.00041 0.0458799 0.049333 0.0557952 0.0754015 0.108712 0.0176811 -0.0873213 0.0478697 -0.0414214 -0.0034144 0.022475 -0.1243054 -0.0088959 -0.1601931 -0.1013191 -0.0119541 0.0025042 -0.0114359 0.077363 unknown
polarizability: 226.988086|-5.2663877|176.3431294|5.1490583|5.2899604|66.2318515 unknown
InChI: InChI=1S/C11H10N2O3/c1-2-12-6-5-11(14)9-7-8(13(15)16)3-4-10(9)12/h3-7H,2H2,1H3
charge 0 multiplicity 1
26 atoms
O  -0.363488 3.230985 0.167572
O  4.097453 -1.394231 0.033394
O  4.017124 0.880615 0.210832
N  -2.235508 -0.48861 -0.280349
N  3.45227 -0.27282 0.086134
C  -0.833659 -0.452516 -0.179447
C  -0.174374 0.816457 -0.030561
C  -2.978349 -1.774145 -0.397077
C  -2.965269 0.69811 -0.213484
C  -0.049246 -1.647144 -0.228091
C  -0.941673 2.099977 0.040564
C  1.235521 0.863919 0.054981
C  -2.389629 1.93997 -0.065177
C  1.976666 -0.323736 -0.003382
C  1.34423 -1.585682 -0.144134
C  -3.183775 -2.479311 0.959556
H  -2.448679 -2.430055 -1.109697
H  -3.957121 -1.544068 -0.852492
H  -4.049781 0.577724 -0.29354
H  -0.524849 -2.625158 -0.330534
H  1.720503 1.838702 0.166972
H  -3.016866 2.833736 -0.027674
H  1.95897 -2.488513 -0.182338
H  -2.223355 -2.73146 1.440443
H  -3.75375 -1.837719 1.653739
H  -3.750768 -3.415926 0.812887
