program: Gaussian 09
title: 000296612
version: EM64L-G09RevD.01
frameworkgroup: C1[X(C10H7N3O3)]
method: RPBEPBE
basis: SDD
operation: Freq
keyword: #p
keyword: freq=noraman
keyword: PBEPBE/SDD
title: #p freq=noraman PBEPBE/SDD
converged: YES YES NO NO
title: Mulliken charges:
elementType: O O O N N N C C C C C C C C C C H H H H H H H
charge: -0.197144 -0.198189 -0.195497 -0.436838 -0.010162 0.028820 0.322191 0.049283 0.270359 -0.368610 -0.338656 0.382049 -0.361854 -0.353208 -0.347058 -0.316948 0.285772 0.284202 0.293743 0.293778 0.283764 0.360320 0.269883
chargesum: 0.00000
title: Mulliken charges with hydrogens summed into heavy atoms:
elementType: O O O N N N C C C C C C C C C C
charge: -0.197144 -0.198189 -0.195497 -0.076518 -0.010162 0.028820 0.322191 0.049283 0.270359 -0.082838 -0.054454 0.382049 -0.068111 -0.059431 -0.063294 -0.047066
polarizability: 2.31626637e+02 4.17253910e+00 1.41542633e+02 9.14664836e+00 6.22048120e+00 6.77544855e+01
1716.lowfreq: -8.7204 -5.9780 -1.4538 -0.0004 0.0005 0.0007 37.6484 54.8954 62.4044
frequency: 37.6044 54.8886 62.4042 79.2165 119.6729 167.7249 183.0597 249.2988 254.4341 274.3702 370.8799 411.2558 455.3755 458.8713 500.1941 564.5441 610.4218 617.6570 623.9653 660.5870 682.8632 688.3824 715.6180 772.0121 785.4112 825.9194 864.6730 873.9219 887.6673 898.3240 900.8092 996.8875 1001.6697 1003.9555 1010.3859 1039.7968 1081.3343 1090.6525 1111.7076 1177.6391 1182.4103 1216.9175 1221.2652 1267.5179 1298.0759 1318.9186 1366.3790 1387.0962 1398.9760 1406.6546 1413.6766 1473.2893 1532.6948 1543.9688 1591.9529 1606.5232 3148.6348 3164.0702 3183.4456 3187.6216 3234.7394 3257.0377 3595.3445
redmass: 7.0597 8.8512 5.3142 5.6559 7.2666 8.2886 7.8019 6.1479 9.1685 6.6104 7.3505 2.9161 6.1141 5.4695 8.2792 6.7562 5.5526 3.1825 6.6737 2.7248 1.9479 5.3109 3.9447 4.1014 9.1479 1.2941 1.2425 3.1340 2.0954 4.4967 1.6473 1.3776 2.1020 2.1998 2.1805 1.4589 3.5231 3.2478 1.3154 2.8328 1.3925 4.8577 4.3735 2.0275 1.2982 4.1426 6.8463 2.2733 10.0580 3.8868 3.4476 2.3517 4.2446 12.0193 7.7250 6.4747 1.0904 1.0900 1.0949 1.0964 1.0937 1.1053 1.0825
irintensity: 0.1658 1.0674 0.7971 2.1700 4.7419 3.0802 4.0258 5.9867 0.3524 0.5111 2.8827 0.2137 9.9705 5.3071 0.7792 0.4971 17.3630 7.8391 1.0513 38.7345 17.6440 18.2494 55.0569 20.9113 65.8971 58.2162 1.5256 59.5339 35.0543 26.9886 12.6916 3.6327 9.7139 5.0646 5.2589 49.3990 18.6066 13.1686 17.9134 26.5337 42.0830 279.4269 32.2263 16.5469 0.9957 253.7970 68.6429 33.1099 6.7268 31.0884 63.7213 1.3127 64.1517 162.0608 3.6376 3.5992 3.2130 1.1522 1.4616 1.6791 1.7399 1.4177 68.9336
temp: 298.150 k
press: 1.00000 atm
elementType: 8 8 8 7 7 7 6 6 6 6 6 6 6 6 6 6 1 1 1 1 1 1 1
symmnumber: 1
zpe: 419669.5 jmol-1
zpe.correction: 0.159844 hartree
zpe.thermalcorrener: 0.172689 hartree
zpe.thermalcorrenthalpy: 0.173633 hartree
zpe.thermalcorrgfe: 0.118693 hartree
zpe.sumelectzpe: -773.968623 hartree
zpe.sumelectthermal: -773.955777 hartree
zpe.sumelectthermalent: -773.954833 hartree
zpe.sumelectthermalfe: -774.009773 hartree
dipole: -2.8994 -0.4408 0.0885
dipole: 2.9341
quadrupole: -111.6455 -98.1883 -90.9675
quadrupole: 5.0866 2.8502 3.4873
quadrupole: -11.3784 2.0788 9.2996 5.0866 2.8502 3.4873
hfenergy: -774.1284664 hartree
pointgroup: C01 [X(C10H7N3O3)]
dipole: -1.1363836 -0.1637939 -0.119787 debye
dipolederiv: -0.8000579 0.0627901 0.0655031 -0.2176583 -0.7540088 -0.2837246 -0.0009636 -0.3052494 -0.5099391 -0.6806224 0.109415 0.1421916 0.1339163 -0.3128931 -0.1928889 0.1586937 -0.1824498 -0.6315394 -0.8238301 -0.0111355 -0.1924118 0.0209527 -0.2646383 -0.1071653 -0.1665809 -0.1134997 -0.5455258 -0.4818542 0.2731371 0.0538142 0.4319411 0.0030957 0.1154356 0.2886912 0.1459316 -0.0614263 -0.2077226 -0.3065187 -0.0994776 -0.0676304 -0.2801826 -0.027591 -0.0856179 -0.1075438 -0.2355853 1.8326445 -0.1957502 -0.0135753 -0.2678708 0.3519049 0.3226048 -0.0653588 0.3233871 0.9622214 -0.4597499 0.0640959 0.045518 0.0482256 -0.0343852 0.0102695 0.0308317 -0.0130255 0.0562205 2.0011155 0.1828605 0.088706 0.5128086 0.8248479 0.4026191 0.2157237 0.4548236 0.5017565 -0.6697001 -0.4996445 -0.2561139 -0.5895282 -0.1194618 -0.1752221 -0.3387484 -0.1455428 -0.1556586 -0.1007295 0.0348699 0.1695368 -0.1306548 -0.1303716 -0.0092055 0.0921554 0.0002731 -0.039252 -0.1863999 -0.0640075 -0.1525495 0.062372 -0.05802 0.1042758 -0.0171056 0.0669478 0.0462745 -0.61223 0.0917036 0.0683625 0.1402913 0.0482285 -0.0070267 0.1110778 -0.0093968 0.0785843 0.0392 -0.0748856 -0.1483966 0.0135595 -0.0777646 0.0395104 0.0718878 0.0073719 -0.0479866 0.0795916 0.0393047 0.1537031 -0.0858837 -0.0897906 -0.0062194 -0.1278116 0.0292442 -0.0572041 0.0812656 0.1367221 0.0793272 -0.0382436 0.0324294 0.0731881 -0.0483983 0.0671778 -0.1264297 0.2440086 0.0971246 0.1113024 -0.0758279 -0.1368846 -0.0092688 0.0674758 0.031481 -0.0855415 0.04186 -0.0005556 -0.0756361 0.0091056 0.1142092 -0.0358242 -0.1106367 -0.0323517 0.037583 0.1044504 0.0331447 0.0467377 -0.0047894 0.1279588 -0.0606271 0.0329535 -0.0345761 0.0482269 0.1168367 0.0179955 0.0347928 0.020064 0.151742 -0.0423272 0.0081975 -0.0391135 0.0719988 0.0832566 -0.0126464 -0.0589511 0.0071904 0.1629014 -0.0193757 -0.0286796 -0.0254617 0.0982624 0.1407967 0.0220409 -0.0086125 0.0454518 0.0606087 -0.0393611 0.0116122 -0.0526122 0.1749511 0.2641005 0.0105053 -0.0116977 0.07376 0.2667668 -0.0187433 -0.0560383 -0.0430637 0.2550184 -0.00623 -0.0105659 -0.0420731 -0.0415519 0.1137078 -0.0333323 -0.0433606 -0.0227514 0.1649905 unknown
polarizability: 231.3241784|-2.2722032|98.1983183|11.138293|36.9658142|111.4012589 unknown
InChI: InChI=1S/C10H7N3O3/c14-10(9-5-6-11-12-9)7-1-3-8(4-2-7)13(15)16/h1-6,12H
charge 0 multiplicity 1
23 atoms
O  -1.837559 1.908065 1.370255
O  4.39334 -0.841675 -1.340714
O  4.866857 -0.034962 0.740709
N  -2.497777 -1.227747 -0.416021
N  -3.685301 -1.773339 -0.850399
N  4.04649 -0.317731 -0.213554
C  -0.116051 0.528507 0.401353
C  -1.558971 0.899113 0.650119
C  -2.634445 0.079026 0.060747
C  0.325345 -0.036456 -0.826712
C  0.83302 0.835266 1.413136
C  2.603988 -0.020125 -0.000613
C  1.691449 -0.309247 -1.036721
C  2.197477 0.554237 1.224666
C  -4.005412 0.389297 -0.084861
C  -4.602978 -0.765107 -0.65693
H  -0.386223 -0.214706 -1.639775
H  0.478823 1.301937 2.337401
H  2.059399 -0.728304 -1.976891
H  2.944689 0.770444 1.992509
H  -4.472743 1.33114 0.190797
H  -1.664224 -1.814341 -0.406425
H  -5.639994 -0.935591 -0.93747
