program: Gaussian 09
title: 000296593
version: EM64L-G09RevD.01
frameworkgroup: C1[X(C10H7FN2O4)]
method: RPBEPBE
basis: SDD
operation: Freq
keyword: #p
keyword: freq=noraman
keyword: PBEPBE/SDD
title: #p freq=noraman PBEPBE/SDD
converged: YES YES NO NO
title: Mulliken charges:
elementType: F O O O O N N C C C C C C C C C C H H H H H H H
charge: -0.164730 -0.232975 -0.194820 -0.257513 -0.218761 -0.159971 -0.403970 -0.473573 0.140851 0.227107 -0.139395 0.234742 0.176798 0.114026 -0.327573 -0.242832 -0.141861 0.273475 0.310838 0.282092 0.369047 0.289049 0.267219 0.272731
chargesum: 0.00000
title: Mulliken charges with hydrogens summed into heavy atoms:
elementType: F O O O O N N C C C C C C C C C C
charge: -0.164730 -0.232975 -0.194820 -0.257513 -0.218761 -0.159971 -0.034923 0.110739 0.140851 0.227107 0.142697 0.234742 0.176798 0.114026 -0.038525 0.024387 0.130870
polarizability: 2.23465383e+02 1.20388623e+01 1.13438291e+02 -1.39560902e+01 -7.61791844e+00 8.10718397e+01
1716.lowfreq: -0.0012 -0.0007 0.0004 1.4963 4.1352 5.3926 21.6827 33.2073 48.1965
frequency: 21.6570 33.1260 48.1883 84.4244 101.0092 127.7444 170.9680 175.4357 243.6914 274.8011 291.1219 308.3954 359.8950 378.5813 408.3330 445.0320 470.4187 511.0209 521.6204 586.2040 625.4408 649.6698 683.6435 685.2613 709.8061 753.5813 761.4152 765.7290 777.7326 846.3395 853.1564 862.7320 868.5829 873.1847 911.2202 961.4221 986.2278 1019.0875 1055.0764 1115.5494 1129.7761 1135.9440 1197.1838 1204.6251 1226.4952 1253.0907 1311.9431 1334.4300 1346.7854 1370.9604 1371.8985 1408.8950 1434.2288 1457.6011 1563.2061 1591.6007 1632.3553 1646.4216 1673.4878 3002.1052 3063.8452 3199.7840 3229.5686 3244.8308 3267.6770 3524.4073
redmass: 7.8026 5.8874 8.0617 6.2919 9.6736 8.5917 8.3662 6.4326 6.0779 5.5063 5.5760 4.6549 7.0593 10.8722 4.1055 10.0918 8.9275 3.4704 7.7412 2.9896 5.0011 4.4721 2.3747 5.5254 8.6327 8.4149 1.2514 3.5647 2.9327 1.4476 2.8262 1.8672 3.7019 4.1705 1.3937 2.6119 2.8153 1.6267 3.3842 3.2727 5.1940 1.6890 2.2747 3.4150 1.5028 2.3814 2.5359 2.1590 1.9296 2.7864 1.7411 3.4121 1.2795 3.9601 6.8069 8.9597 5.7600 12.1903 6.5868 1.0611 1.0991 1.0945 1.0917 1.0994 1.1093 1.0770
irintensity: 0.3079 0.7533 0.1813 6.1274 1.1196 2.1076 7.4374 2.6535 0.4499 3.5156 18.7499 1.9124 0.6531 20.7363 11.3730 10.1537 6.8344 1.0620 31.2550 10.1290 1.8627 6.4655 10.7115 24.3290 1.8047 17.9460 84.1610 23.1474 111.1550 12.8979 13.8608 45.0214 8.9287 6.8854 2.3528 14.2508 18.9327 53.4787 47.3495 12.2921 109.1454 20.0393 6.8009 15.3827 43.5134 108.3482 95.6953 20.5308 103.6673 12.9772 18.5201 22.5929 38.5496 155.3153 103.2633 192.6121 242.4638 237.5306 551.5091 51.2513 12.0020 1.3945 0.8225 2.3890 0.0094 69.1658
temp: 298.150 k
press: 1.00000 atm
elementType: 9 8 8 8 8 7 7 6 6 6 6 6 6 6 6 6 6 1 1 1 1 1 1 1
symmnumber: 1
zpe: 425569.6 jmol-1
zpe.correction: 0.162091 hartree
zpe.thermalcorrener: 0.176502 hartree
zpe.thermalcorrenthalpy: 0.177446 hartree
zpe.thermalcorrgfe: 0.118297 hartree
zpe.sumelectzpe: -894.281725 hartree
zpe.sumelectthermal: -894.267314 hartree
zpe.sumelectthermalent: -894.266370 hartree
zpe.sumelectthermalfe: -894.325518 hartree
dipole: 8.6583 0.2347 -2.4782
dipole: 9.0091
quadrupole: -93.5131 -104.1967 -94.7605
quadrupole: -8.0602 -0.2700 -0.5474
quadrupole: 3.9770 -6.7066 2.7296 -8.0602 -0.2700 -0.5474
hfenergy: -894.4438156 hartree
pointgroup: C01 [X(C10H7F1N2O4)]
dipole: -3.3968683 0.2832664 -0.9716512 debye
dipolederiv: -0.3803078 -0.2483142 -0.0599127 -0.5107193 -0.7686607 -0.1266327 -0.0968376 -0.107697 -0.1354979 -0.3232239 0.0988012 0.2464639 0.1135268 -0.1558107 -0.1334721 0.2627471 -0.1354386 -0.4477695 -0.9647112 -0.0127295 -0.1059526 -0.2169376 -0.330666 -0.1591005 -0.3216004 -0.1433835 -0.673749 -0.7245989 -0.2669377 -0.0538378 -0.2718041 -1.1613692 -0.13786 -0.092656 -0.1205947 -0.3854625 -1.4288042 -0.0486003 -0.1804173 0.1710072 -0.44177 0.0232377 -0.2060993 -0.0164335 -0.3820919 -0.8615996 0.2783167 -0.054347 -0.6018052 -0.9607866 -0.1971637 -0.0550573 0.0104272 -0.2062976 -1.0583676 -0.3572541 -0.1374985 -0.3690743 -0.5651708 -0.0938422 -0.170274 -0.0914794 -0.3789919 0.5621648 -0.0726059 0.1274044 0.1946703 -0.0075945 -0.1558593 0.4884386 -0.1986621 -0.0614297 1.9925579 -0.0209139 0.0353129 -0.0048216 0.2567526 0.257266 -0.035608 0.2306039 0.7430624 1.220985 0.0866309 0.151228 0.1828916 1.6912124 0.1667257 0.1696469 0.117671 0.3450494 0.8044054 0.039637 0.0898915 0.7549451 0.2841555 0.1350366 0.0467348 0.0466027 0.0398157 -1.1460562 -0.0381069 -0.164807 0.1272187 -0.0044864 0.0960623 0.2057599 0.0882296 0.2318647 -0.4190087 0.4023885 -0.0050081 1.0062076 0.6544482 0.2124257 0.0223089 0.1557559 0.0184747 1.9087673 0.1563271 0.288944 -0.2685266 0.8356126 0.0100355 0.2981558 0.0674798 0.344976 0.3792887 0.0606666 0.1768019 -0.0229248 -0.0895049 0.0436669 -0.0499702 0.0541128 0.0146817 -0.0885949 -0.0254004 -0.0723505 -0.1250623 -0.1998956 -0.0227552 -0.3083773 -0.0170633 -0.255468 -0.0223834 -0.0801734 -0.2235894 0.0019217 -0.0232537 0.1440295 -0.004913 0.136896 0.2710966 -0.0615294 0.0404548 -0.0038494 0.0660197 0.0622345 0.0953649 -0.0672167 0.0611146 0.0209658 0.110329 -0.0135375 0.0178017 -0.1880112 0.11501 -0.0057976 -0.0107499 0.0119357 0.1268252 0.1018036 0.0632006 -0.0210633 0.0417704 0.0525477 -0.0036901 -0.0134539 -0.0068693 0.1613701 0.1834389 -0.0373248 -0.0360188 -0.0711967 0.2093479 -0.019208 -0.0389486 -0.0177374 0.3294881 0.139769 -0.0127915 -0.0287327 -0.0085428 0.1694011 -0.0476797 -0.0252887 -0.0467287 0.0687174 -0.0122556 0.0124303 0.0268359 0.0112476 0.1902045 -0.025688 0.0289407 -0.0252687 0.1357279 0.0879316 -0.0041635 -0.0132988 -0.012 0.1880423 -0.0551018 -0.0256819 -0.0534728 0.0746423 unknown
polarizability: 223.1753588|5.5336098|103.8284458|18.6599377|16.6144223|90.971709 unknown
InChI: InChI=1S/C10H7FN2O4/c11-6-4-13(10(16)12-9(6)15)5-7(14)8-2-1-3-17-8/h1-4,12H,5H2
charge 0 multiplicity 1
24 atoms
F  3.517858 2.304716 0.290605
O  -3.350967 -0.223082 -0.992199
O  -0.867052 0.73939 1.491747
O  0.989741 -2.509117 -0.624646
O  4.946041 -0.202487 0.379833
N  0.894726 -0.157296 -0.489832
N  2.935384 -1.299544 -0.128921
C  -0.544435 -0.17728 -0.77413
C  -1.390177 0.311019 0.422481
C  1.568313 -1.406822 -0.424014
C  1.553609 1.044043 -0.23105
C  -2.841215 0.262279 0.243864
C  2.89228 1.0822 0.051669
C  3.715666 -0.127782 0.127955
C  -3.908792 0.598904 1.076325
C  -5.119998 0.318454 0.35335
C  -4.743136 -0.175615 -0.890581
H  -0.777461 0.434311 -1.666342
H  -0.81236 -1.2218 -1.016709
H  0.956549 1.957367 -0.25809
H  3.443467 -2.189091 -0.083609
H  -3.812168 0.994427 2.085139
H  -6.139683 0.460088 0.704485
H  -5.292789 -0.519084 -1.76303
