program: Gaussian 09
title: 000296548
version: EM64L-G09RevD.01
frameworkgroup: C1[X(C14H15N3)]
method: RPBEPBE
basis: SDD
operation: Freq
keyword: #pfreq=noraman
keyword: PBEPBE/SDD
title: #p freq=noraman PBEPBE/SDD
converged: YES YES NO NO
title: Mulliken charges:
elementType: N N N C C C C C C C C C C C C C C H H H H H H H H H H H H H H H
charge: -0.056884 -0.634445 -0.017536 -0.423826 -0.520093 -0.407211 0.276730 -0.440888 -0.412672 0.200136 -0.418270 -0.035530 0.371910 0.017915 -0.502262 -0.262057 -0.344057 0.210502 0.204531 0.212059 0.234003 0.212974 0.206516 0.210939 0.222800 0.253125 0.237865 0.245389 0.254776 0.325410 0.338658 0.239492
chargesum: 0.00000
title: Mulliken charges with hydrogens summed into heavy atoms:
elementType: N N N C C C C C C C C C C C C C C
charge: -0.056884 0.029624 -0.017536 -0.008793 -0.074030 0.012279 0.276730 -0.007148 -0.159547 0.200136 -0.180405 -0.035530 0.371910 0.017915 -0.256873 -0.007281 -0.104565
polarizability: 2.85195638e+02 -2.55632540e+01 1.70042313e+02 3.33132120e+00 1.74585937e+00 9.52558241e+01
1716.lowfreq: -20.0513 -8.0060 -5.0346 -0.0009 -0.0008 0.0002 30.5536 50.0248 79.6128
frequency: 29.4698 50.0211 79.6032 123.3835 129.7080 183.3037 236.7741 251.1833 276.5458 304.4744 318.8873 335.4607 406.5962 441.5262 455.5802 460.1705 473.9558 478.8389 512.9096 549.0987 576.8644 589.2835 597.4501 630.9707 704.6204 734.6924 746.1162 791.3107 797.4090 811.6566 834.9228 845.4900 857.5056 889.4967 892.8914 913.5094 926.9713 932.4115 941.8079 967.0004 984.4520 1011.2719 1059.1526 1072.6274 1077.5882 1105.0566 1133.7374 1166.3359 1172.4694 1201.6644 1230.7413 1241.9780 1252.1818 1270.3768 1310.8806 1314.4627 1327.3461 1336.2256 1339.5526 1345.3016 1350.1572 1361.9276 1397.5961 1413.6233 1452.5792 1456.3930 1458.5062 1469.0085 1471.5956 1475.2703 1523.6124 1563.4532 1599.2864 1610.7948 1650.1756 2946.3396 2956.8695 2979.4410 2981.6606 3008.0310 3020.9245 3042.5489 3050.8038 3096.2247 3097.3942 3132.4138 3138.6230 3172.3655 3534.0379 3690.4234
redmass: 3.3721 3.9521 3.4177 5.4853 2.9516 3.1682 4.8777 2.5982 5.1880 3.1249 2.2413 3.8604 2.8576 4.7775 2.1302 2.5909 1.4080 2.9810 4.0784 2.8377 2.2972 1.9079 4.4954 6.9707 3.5996 4.2791 5.4451 4.0526 3.8031 1.4045 1.4544 3.0226 1.5169 4.4658 1.4653 2.3875 1.9903 1.5035 1.7191 1.4166 2.9087 2.1843 2.1325 1.8291 1.8510 1.4947 1.1624 2.0996 1.5184 2.0763 2.1474 1.3605 1.7227 1.2537 1.3356 2.0701 2.3236 1.4036 1.8639 1.8314 2.5202 1.6936 3.0928 5.0480 1.1117 2.8644 1.0962 1.3935 2.0803 1.1015 6.5757 2.9470 2.4255 3.1422 6.5711 1.0662 1.0646 1.0650 1.0632 1.0900 1.0938 1.0983 1.1041 1.0904 1.0909 1.0913 1.0891 1.0970 1.0440 1.1051
irintensity: 0.1238 0.0094 0.3404 0.1173 0.5124 0.2859 0.8149 0.1836 7.2745 1.0754 5.7154 1.7590 6.8659 4.1351 70.2945 3.5118 113.9800 9.0854 4.3015 7.9289 8.3552 42.7220 1.6348 12.5328 15.1737 1.4005 4.4175 5.8385 2.5769 4.9727 38.6337 3.9950 10.8039 11.4122 14.0656 2.8161 7.7983 11.8554 2.5263 0.8473 6.5353 3.0672 1.7829 1.4720 0.4876 1.4821 8.5163 2.5064 0.1118 7.4167 2.9074 2.0549 38.8405 4.2240 1.0288 5.3573 0.5803 1.2180 2.8963 4.3299 4.5201 9.0318 14.3640 22.2594 1.8759 134.7543 9.4320 62.4057 75.2627 6.5529 24.8842 38.7216 40.5924 344.6434 5.0078 38.9141 19.3225 35.7619 23.8364 49.5736 24.2284 67.9581 58.7831 15.9017 24.1048 13.9159 17.7345 21.5915 78.1440 54.8814
temp: 298.150 k
press: 1.00000 atm
elementType: 7 7 7 6 6 6 6 6 6 6 6 6 6 6 6 6 6 1 1 1 1 1 1 1 1 1 1 1 1 1 1 1
symmnumber: 1
zpe: 688662.4 jmol-1
zpe.correction: 0.262298 hartree
zpe.thermalcorrener: 0.276372 hartree
zpe.thermalcorrenthalpy: 0.277317 hartree
zpe.thermalcorrgfe: 0.220914 hartree
zpe.sumelectzpe: -705.538601 hartree
zpe.sumelectthermal: -705.524526 hartree
zpe.sumelectthermalent: -705.523582 hartree
zpe.sumelectthermalfe: -705.579985 hartree
dipole: -6.1284 1.4653 0.5572
dipole: 6.3257
quadrupole: -103.8855 -94.8121 -102.6835
quadrupole: 6.0350 0.8025 0.6758
quadrupole: -3.4252 5.6483 -2.2231 6.0350 0.8025 0.6758
hfenergy: -705.8008985 hartree
pointgroup: C01 [X(C14H15N3)]
dipole: -2.4169448 0.5810002 -0.1205519 debye
polarizability: 285.0473604|-18.8336766|154.9647134|18.66843|-29.842601|110.4817008 unknown
InChI: InChI=1S/C14H15N3/c15-14-12(10-4-2-1-3-5-10)8-11-9-16-7-6-13(11)17-14/h4,6-9H,1-3,5,15H2
charge 0 multiplicity 1
32 atoms
N  1.46824 1.660406 -0.536081
N  -0.66668 2.523771 -0.780035
N  4.135282 -1.445955 0.624491
C  -4.042876 -0.649856 1.341481
C  -2.506767 -0.77163 1.22711
C  -4.718663 -0.97332 -0.008785
C  -1.945649 -0.05582 -0.004813
C  -4.25785 0.026411 -1.094452
C  -2.766049 0.302678 -1.04155
C  -0.468214 0.170608 -0.040509
C  0.420407 -0.825251 0.372154
C  0.13264 1.443366 -0.462364
C  1.838043 -0.630349 0.317035
C  2.322643 0.640638 -0.170402
C  2.79779 -1.620676 0.696564
C  3.739033 0.821362 -0.246899
C  4.582228 -0.221673 0.150758
H  -4.413513 -1.326081 2.134713
H  -4.309842 0.382218 1.645599
H  -2.229119 -1.846213 1.184666
H  -2.019814 -0.369692 2.136696
H  -5.820219 -0.948826 0.088139
H  -4.442903 -2.001918 -0.315059
H  -4.813295 0.983675 -0.98644
H  -4.519688 -0.353151 -2.10222
H  -2.328387 0.773721 -1.933689
H  0.034408 -1.789818 0.722093
H  2.454641 -2.595484 1.069555
H  4.13575 1.772456 -0.612768
H  -0.200497 3.398567 -1.011799
H  -1.676687 2.477865 -0.675505
H  5.671106 -0.110928 0.104114
