program: Gaussian 09
title: 000296535
version: EM64L-G09RevD.01
frameworkgroup: C1[X(C16H16N2O2)]
method: RPBEPBE
basis: SDD
operation: Freq
keyword: #p
keyword: freq=noraman
keyword: PBEPBE/SDD
title: #p freq=noraman PBEPBE/SDD
converged: YES YES NO NO
title: Mulliken charges:
elementType: O O N N C C C C C C C C C C C C C C C C H H H H H H H H H H H H H H H H
charge: -0.262555 -0.228585 0.010724 -0.427756 0.341240 0.070552 -0.351704 -0.360556 0.328266 -0.375893 -0.355059 -0.805680 0.256834 0.165968 -0.351635 -0.361035 -0.218125 -0.233880 -0.226814 -0.536953 0.211292 0.292655 0.249047 0.242801 0.232680 0.243869 0.254498 0.273541 0.221966 0.310200 0.233258 0.229867 0.233177 0.224003 0.224597 0.245195
chargesum: 0.00000
title: Mulliken charges with hydrogens summed into heavy atoms:
elementType: O O N N C C C C C C C C C C C C C C C C
charge: -0.262555 -0.228585 0.010724 -0.117556 0.341240 0.070552 -0.140412 -0.067900 0.328266 -0.126847 -0.112258 -0.074633 0.256834 0.165968 -0.078094 -0.139069 0.015133 -0.004013 0.006363 0.156842
polarizability: 4.15356038e+02 1.71859160e+00 1.94799605e+02 4.33718639e+00 8.94786406e+00 9.21290956e+01
1716.lowfreq: -0.0010 -0.0007 -0.0002 1.2403 4.8225 10.4177 20.9949 33.2652 38.2671
frequency: 20.9858 33.2610 38.2309 49.8675 67.9326 81.9218 104.5139 113.4518 127.7664 173.0680 201.8644 214.6718 231.3033 269.2973 283.5430 318.4910 360.9358 376.4594 403.3542 412.7046 418.1074 445.9457 474.5469 492.7910 523.8268 551.6640 577.5618 605.9150 616.0048 632.6152 651.3340 682.3696 697.2708 704.2281 735.7433 783.3848 789.6995 817.4296 839.0027 856.2761 876.6885 932.9849 949.5462 957.4875 982.9114 984.5431 988.6030 989.5847 998.2892 1004.7029 1019.0968 1027.4578 1041.9606 1074.2886 1085.6462 1111.3610 1118.0521 1139.3142 1159.1573 1173.9058 1180.6494 1189.9430 1236.2945 1241.3068 1303.8709 1315.8399 1327.8090 1363.9260 1383.7336 1389.1379 1425.2919 1432.2825 1437.3106 1451.3957 1466.8881 1472.0717 1475.7848 1483.2436 1495.5507 1520.8489 1539.3825 1576.4889 1581.6972 1609.7322 1619.7864 1621.9696 2963.2388 2964.5585 3033.1921 3052.8501 3118.0072 3124.8865 3127.1365 3132.5240 3141.5602 3145.2296 3150.6246 3158.3460 3167.7937 3170.0859 3171.6586 3427.3862
redmass: 5.4766 3.6462 4.8015 3.7501 3.3534 1.7791 2.2807 5.2636 3.8083 4.2253 4.5316 1.8268 2.2554 3.8154 4.2453 3.4282 6.3013 5.0212 2.8366 3.3815 4.2022 4.1374 4.1805 2.6127 4.2680 2.1594 5.1272 1.8140 3.8021 7.0467 5.9112 5.0022 3.8673 1.6588 3.7446 5.9147 2.2879 1.2891 1.5955 1.2488 3.8944 1.4822 1.3734 3.7784 1.4753 8.0345 1.3670 4.7294 2.6783 1.3412 2.8583 1.5816 2.1384 3.0091 1.7065 1.2596 1.5956 2.4821 1.3351 1.0589 1.2718 1.1190 2.8535 3.3267 1.3189 1.3660 3.2973 4.5633 8.6737 1.2734 3.5921 2.1641 1.2183 1.2868 1.0501 1.0931 1.6271 1.2721 1.8628 1.7423 6.7804 6.7961 6.2023 6.0440 7.0452 7.0810 1.0328 1.0417 1.0976 1.1041 1.0869 1.0925 1.0997 1.0870 1.0870 1.0920 1.0877 1.0957 1.0955 1.1007 1.0966 1.0746
irintensity: 2.1679 0.8944 2.8711 3.0651 0.8025 6.7578 1.1284 3.0958 1.1765 2.6242 0.7477 2.1073 3.1216 4.3537 7.3208 2.5530 3.1874 9.3916 0.6399 4.3258 5.9719 6.2980 1.7879 0.9801 7.5056 47.0369 12.8689 36.7507 11.0146 2.8438 3.6486 22.7099 33.5433 72.5594 1.3138 5.2485 23.5162 8.4949 74.8846 1.6005 31.5924 3.8102 0.7692 37.3279 3.8573 51.3762 4.2910 0.2866 6.4786 1.7646 19.5351 3.0838 0.7580 3.9114 46.6180 0.2005 62.2553 89.3014 0.1347 3.8436 172.4544 17.7035 393.9313 84.2199 4.1317 2.6495 133.3511 6.8634 0.5481 34.4516 5.8320 13.2333 7.2919 191.7093 14.0686 98.7794 25.7057 51.1388 206.1188 32.7643 4.3739 32.5703 25.7798 3.9074 174.3214 141.3723 81.5390 11.9827 16.4574 46.2139 15.8433 12.7713 28.5809 1.3951 14.9764 23.3169 6.1335 17.5719 13.6352 27.6725 8.7368 13.6844
temp: 298.150 k
press: 1.00000 atm
elementType: 8 8 7 7 6 6 6 6 6 6 6 6 6 6 6 6 6 6 6 6 1 1 1 1 1 1 1 1 1 1 1 1 1 1 1 1
symmnumber: 1
zpe: 745191.2 jmol-1
zpe.correction: 0.283828 hartree
zpe.thermalcorrener: 0.302486 hartree
zpe.thermalcorrenthalpy: 0.303430 hartree
zpe.thermalcorrgfe: 0.234651 hartree
zpe.sumelectzpe: -877.793228 hartree
zpe.sumelectthermal: -877.774570 hartree
zpe.sumelectthermalent: -877.773626 hartree
zpe.sumelectthermalfe: -877.842405 hartree
dipole: -0.4776 3.5079 -0.4543
dipole: 3.5693
quadrupole: -87.0824 -107.4011 -121.7677
quadrupole: -18.2718 1.9148 2.1678
quadrupole: 18.3347 -1.9840 -16.3507 -18.2718 1.9148 2.1678
hfenergy: -878.0770564 hartree
pointgroup: C01 [X(C16H16N2O2)]
dipole: -0.1662033 -1.3883229 0.1299161 debye
polarizability: 415.3013878|1.8596032|194.0298986|-6.1232505|12.5271651|92.9534525 unknown
InChI: InChI=1S/C16H16N2O2/c1-12(13-8-10-15(20-2)11-9-13)17-18-16(19)14-6-4-3-5-7-14/h3-11,18H,1-2H3
charge 0 multiplicity 1
36 atoms
O  6.405969 0.358009 -0.08559
O  -1.965844 2.043603 0.117271
N  -0.012335 0.033733 0.086818
N  -1.369701 -0.230887 0.13334
C  2.275898 -0.632074 0.147062
C  0.834382 -0.979876 0.225602
C  3.30207 -1.619034 0.084133
C  2.672923 0.736406 0.122726
C  5.029692 0.107018 -0.010288
C  4.658705 -1.259573 0.00556
C  4.025899 1.110596 0.047719
C  0.37609 -2.414912 0.4523
C  -3.738374 0.380912 0.041747
C  -2.297941 0.827548 0.089716
C  -4.715119 1.28864 0.52682
C  -4.158411 -0.865246 -0.496565
C  -6.082613 0.946998 0.503085
C  -5.529274 -1.204639 -0.523946
C  -6.493941 -0.303542 -0.017303
C  6.841465 1.757758 -0.112626
H  3.05399 -2.685442 0.079713
H  1.889362 1.498879 0.163967
H  5.445702 -2.017772 -0.047151
H  4.287043 2.173117 0.037294
H  -0.367842 -2.47058 1.272146
H  -0.090183 -2.84165 -0.458607
H  1.207931 -3.072661 0.738374
H  -4.37543 2.257241 0.907991
H  -3.43288 -1.557658 -0.941724
H  -1.726828 -1.18773 0.249528
H  -6.8278 1.652954 0.885614
H  -5.845252 -2.162361 -0.951941
H  -7.55693 -0.568072 -0.039204
H  6.541094 2.289956 0.81053
H  6.435781 2.287726 -0.995924
H  7.938502 1.714916 -0.176488
