program: Gaussian 09
title: 000026702
version: EM64L-G09RevD.01
frameworkgroup: C1[X(C12H15N)]
method: RPBEPBE
basis: SDD
operation: Freq
keyword: #pfreq=noraman
keyword: PBEPBE/SDD
title: #p freq=noraman PBEPBE/SDD
converged: YES YES NO NO
title: Mulliken charges:
elementType: N C C C C C C C C C C C C H H H H H H H H H H H H H H H
charge: -0.475758 0.187930 -0.385756 -0.777246 -0.710296 0.461203 0.243112 -0.444623 -0.339830 -0.198167 -0.243987 -0.276815 -0.539895 0.206449 0.241315 0.295866 0.244145 0.217940 0.233417 0.237330 0.213148 0.218214 0.209957 0.239034 0.218457 0.217634 0.223474 0.283746
chargesum: 0.00000
title: Mulliken charges with hydrogens summed into heavy atoms:
elementType: N C C C C C C C C C C C C
charge: -0.179892 0.187930 0.062007 -0.081744 -0.041604 0.461203 0.243112 -0.234666 -0.100795 0.020290 -0.026352 -0.053341 -0.256149
polarizability: 1.71339014e+02 1.35707150e+00 1.33506348e+02 6.62204715e+00 -5.19513316e+00 9.39732535e+01
1716.lowfreq: -1.5659 -0.0004 -0.0003 -0.0003 9.1729 15.1125 45.1768 69.3795 86.7068
frequency: 44.5798 69.3516 86.6771 113.7994 148.2808 173.6883 209.2033 226.1518 259.9156 274.6045 305.5369 317.3148 327.0720 377.9545 410.9096 434.1930 512.2763 517.9390 575.2781 611.9723 637.5707 639.2634 649.7736 690.2455 693.4391 751.7016 779.0567 814.4421 818.1026 871.0858 884.3922 952.4461 957.3927 972.1075 978.9931 999.1997 1013.2473 1028.8478 1066.7662 1088.9461 1151.2172 1164.2053 1170.1065 1189.4494 1191.7354 1272.9262 1294.1098 1325.0041 1332.2798 1377.7694 1382.0677 1396.9878 1433.4090 1461.4968 1471.1391 1477.0521 1484.5745 1486.6069 1489.6702 1501.5084 1590.0527 1621.1968 2123.5927 2984.4649 2987.4288 2999.4842 3055.1755 3078.3626 3082.8602 3087.4610 3103.4954 3117.1915 3123.5032 3135.2762 3159.4159 3171.6838 3424.5045 3554.1304
redmass: 4.0811 3.1910 2.5618 3.2755 2.9294 3.0024 3.2858 1.1076 1.2443 2.3789 3.5477 1.3796 3.2356 2.5218 2.9109 4.2559 2.9448 4.7129 4.3219 6.3183 1.2464 3.8329 1.2954 2.3194 3.0623 1.8061 1.2274 1.5681 2.3124 1.4978 1.8237 1.3669 2.0198 1.3195 4.9860 2.0943 1.5754 2.0024 2.3280 1.6232 2.7995 1.9561 1.2071 1.8352 1.2940 1.2740 2.2269 1.4512 1.4034 1.5341 2.4384 1.2079 2.3511 1.0680 1.0497 1.0719 1.3689 1.1328 1.2841 1.9744 4.8979 6.3070 6.0183 1.0358 1.0370 1.0623 1.0994 1.0987 1.1005 1.1008 1.0874 1.0979 1.0863 1.0931 1.0961 1.0974 1.1587 1.0768
irintensity: 1.1667 0.6629 0.0200 0.1699 0.6910 1.3566 5.3316 0.0443 0.6155 4.2659 0.7649 79.0544 0.2158 1.3716 0.1576 3.6806 9.4055 1.7079 1.7863 0.2530 64.8097 5.8523 64.0918 30.1490 26.0899 84.0075 5.5492 2.9133 3.2359 9.0440 10.0866 0.1204 0.8107 0.5524 3.7037 1.6544 12.0151 10.5146 5.7578 9.2889 17.4086 38.9125 11.5512 40.1926 10.7859 8.0537 76.7699 3.8290 32.8819 51.4140 26.1712 15.8259 5.8174 4.8605 6.1226 2.9325 8.0429 20.1449 52.5637 148.7132 6.5328 175.8319 0.3921 35.1102 22.4068 22.4333 1.1355 41.6903 16.9052 50.7258 17.3671 19.1743 2.2217 35.0132 41.7142 5.9608 59.3268 20.2518
temp: 298.150 k
press: 1.00000 atm
elementType: 7 6 6 6 6 6 6 6 6 6 6 6 6 1 1 1 1 1 1 1 1 1 1 1 1 1 1 1
symmnumber: 1
zpe: 614499.6 jmol-1
zpe.correction: 0.234051 hartree
zpe.thermalcorrener: 0.247726 hartree
zpe.thermalcorrenthalpy: 0.248670 hartree
zpe.thermalcorrgfe: 0.194312 hartree
zpe.sumelectzpe: -519.994386 hartree
zpe.sumelectthermal: -519.980711 hartree
zpe.sumelectthermalent: -519.979767 hartree
zpe.sumelectthermalfe: -520.034125 hartree
dipole: 1.9401 1.2019 -0.1083
dipole: 2.2848
quadrupole: -76.2646 -69.1278 -81.1069
quadrupole: 0.6962 0.0869 -0.2690
quadrupole: -0.7649 6.3720 -5.6071 0.6962 0.0869 -0.2690
hfenergy: -520.228437 hartree
pointgroup: C01 [X(C12H15N1)]
dipole: -0.7418253 -0.4845873 0.1514393 debye
polarizability: 171.6973933|3.1023316|126.3184069|2.1042165|-16.3048059|100.8028148 unknown
InChI: InChI=1S/C12H15N/c1-4-12(3,5-2)13-11-9-7-6-8-10-11/h1,6-10,13H,5H2,2-3H3
charge 0 multiplicity 1
28 atoms
N  -0.239593 -0.910224 0.707889
C  -1.571534 -0.551517 0.161779
C  -1.649158 -0.934433 -1.36052
C  -2.612923 -1.378139 0.971113
C  -2.962258 -0.547535 -2.070564
C  1.013103 -0.375318 0.368788
C  -1.873136 0.896787 0.367214
C  2.176374 -0.958867 0.957849
C  1.188977 0.7220 -0.525278
C  3.462002 -0.469829 0.658791
C  2.485099 1.197161 -0.8191
C  3.633053 0.611857 -0.238724
C  -2.151264 2.082826 0.557347
H  -1.487692 -2.028435 -1.416284
H  -0.797334 -0.465265 -1.88384
H  -0.248313 -1.594536 1.464513
H  -3.636543 -1.145872 0.639671
H  -2.431017 -2.458831 0.821592
H  -2.542805 -1.141602 2.047761
H  -3.150394 0.538381 -1.995258
H  -3.836409 -1.075351 -1.648004
H  -2.904859 -0.808459 -3.142917
H  2.061832 -1.803683 1.650266
H  0.323032 1.225995 -0.961793
H  4.335578 -0.938614 1.126958
H  2.593416 2.044554 -1.506571
H  4.633384 0.990101 -0.473135
H  -2.37222 3.12055 0.727659
