program: Gaussian 09
title: 000296516
version: EM64L-G09RevD.01
frameworkgroup: C1[X(C12H17FN4O3)]
method: RPBEPBE
basis: SDD
operation: Freq
keyword: #p
keyword: freq=noraman
keyword: PBEPBE/SDD
title: #p freq=noraman PBEPBE/SDD
converged: YES YES NO NO
title: Mulliken charges:
elementType: F O O O N N N N C C C C C C C C C C C C H H H H H H H H H H H H H H H H H
charge: -0.197101 -0.295588 -0.259491 -0.165965 -0.105831 -0.165097 0.029385 -0.421695 -0.350081 -0.416136 -0.528339 0.267503 -0.656948 -0.645922 -0.163069 0.074498 0.113122 0.161570 0.225756 -0.796863 0.210183 0.256046 0.225305 0.303165 0.264001 0.274863 0.250268 0.212674 0.218977 0.218280 0.214843 0.230728 0.319666 0.343868 0.271906 0.240862 0.240657
chargesum: 0.00000
title: Mulliken charges with hydrogens summed into heavy atoms:
elementType: F O O O N N N N C C C C C C C C C C C C
charge: -0.197101 -0.295588 -0.259491 -0.165965 -0.105831 -0.165097 0.029385 -0.077827 0.116148 0.112333 0.010526 0.267503 0.024971 0.017929 0.156597 0.074498 0.113122 0.161570 0.225756 -0.043437
polarizability: 2.54214353e+02 -1.07934759e+01 1.70937529e+02 -1.39389720e+01 -5.72883647e+00 1.20843030e+02
1716.lowfreq: -29.6742 -5.1657 0.0003 0.0007 0.0008 4.1876 7.3463 22.2150 25.0808
frequency: -29.5115 22.2001 24.9249 42.7564 53.5027 61.3833 63.4910 84.9223 103.6730 105.3836 117.6981 143.1237 197.2875 213.4258 214.7747 237.7394 246.3717 261.0974 298.7688 315.1094 340.6027 354.4763 386.4148 413.2473 427.2605 439.4420 465.8060 487.6726 503.2701 573.0704 578.9046 590.9033 610.3532 636.4526 675.2439 685.3571 714.9701 734.3976 739.7095 771.9139 793.1199 805.0495 854.8904 881.2774 903.1766 910.0170 943.7013 969.2619 976.4224 1021.4342 1030.4199 1033.0190 1075.6368 1079.3806 1087.3126 1098.7208 1142.4239 1168.4410 1197.9251 1204.2844 1227.5313 1272.6759 1289.4681 1301.5533 1321.1249 1350.2295 1352.5268 1375.2547 1375.7337 1385.2115 1391.2987 1418.6777 1426.8580 1445.7979 1452.9044 1454.7214 1467.2349 1468.8145 1470.2960 1473.8787 1478.2033 1482.7774 1526.2026 1536.6050 1585.3533 1600.7544 1645.5111 1680.1147 2982.7473 2987.4452 2987.6925 3003.8470 3010.8039 3041.7622 3057.2600 3071.6643 3073.2347 3085.4146 3086.1379 3087.2806 3104.5300 3132.1773 3139.0872 3187.6381 3508.4511
redmass: 1.1868 5.7469 5.1131 3.5927 3.7357 4.0450 3.7234 2.8759 5.5878 7.6114 5.9864 3.4538 2.0615 1.2983 2.0197 4.8079 3.0726 5.5351 3.7079 3.0588 2.9595 8.0520 6.0622 2.8902 3.2597 3.2480 6.6648 3.1989 5.0377 2.9477 4.4869 4.7059 5.4684 6.3368 3.6715 1.7367 4.0738 6.1903 3.8441 1.8418 1.7668 1.2756 3.4394 1.6628 2.7288 5.5341 2.1308 2.3052 2.0106 4.9139 2.8831 1.6996 2.1846 1.8564 4.0558 1.8257 2.0518 3.3797 2.2539 2.7759 1.9432 1.4609 2.6750 1.2601 1.4748 1.3114 1.5405 1.2619 1.2334 1.2154 1.2126 2.5092 2.7342 1.2490 1.1882 1.1181 1.0476 1.0461 1.0421 3.4923 1.0716 1.0607 1.1180 2.4461 5.3816 8.4415 6.7662 6.8276 1.0359 1.0357 1.0383 1.0624 1.0621 1.0640 1.1022 1.1005 1.0983 1.1019 1.0994 1.0997 1.1023 1.0992 1.0982 1.0957 1.0764
irintensity: 2.2271 1.3310 4.5204 2.7280 1.7381 10.5208 3.6821 0.9514 2.0748 1.2097 4.0425 2.3869 0.1235 0.2973 0.8499 1.5762 0.3129 3.3992 0.3387 1.0183 14.0880 2.0034 11.9893 2.6274 9.2754 10.9035 1.5240 14.1857 3.9407 0.1822 7.5208 5.0584 24.5359 8.0866 9.8049 30.5693 8.9838 6.1277 75.7300 7.4383 5.5382 21.0157 5.4453 17.3113 2.5087 1.4605 7.5837 16.4030 76.8172 54.0415 30.1377 10.3522 10.1911 8.4707 6.1574 22.7238 18.2660 80.0323 255.9020 38.1030 52.1003 96.6062 35.9110 9.5929 7.0580 27.4494 41.8187 17.9217 58.9241 14.1853 23.1969 32.7203 150.8248 236.7545 14.4869 32.4760 22.4815 2.3609 18.0911 674.3866 14.9475 9.8664 26.5078 287.9976 171.2762 399.5845 207.9890 171.0385 24.1782 21.5773 5.5277 21.9099 52.1082 18.1134 22.2508 4.9582 12.8610 36.6162 25.0860 33.2713 27.5902 2.0149 7.5034 10.8270 39.7661
temp: 298.150 k
press: 1.00000 atm
elementType: 9 8 8 8 7 7 7 7 6 6 6 6 6 6 6 6 6 6 6 6 1 1 1 1 1 1 1 1 1 1 1 1 1 1 1 1 1
symmnumber: 1
zpe: 759135.3 jmol-1
zpe.correction: 0.289139 hartree
zpe.thermalcorrener: 0.309593 hartree
zpe.thermalcorrenthalpy: 0.310537 hartree
zpe.thermalcorrgfe: 0.237586 hartree
zpe.sumelectzpe: -1010.495789 hartree
zpe.sumelectthermal: -1010.475335 hartree
zpe.sumelectthermalent: -1010.474391 hartree
zpe.sumelectthermalfe: -1010.547342 hartree
dipole: 1.4895 3.5658 -0.2742
dipole: 3.8741
quadrupole: -85.4381 -140.1312 -110.5853
quadrupole: -22.9947 0.9374 1.3249
quadrupole: 26.6134 -28.0797 1.4663 -22.9947 0.9374 1.3249
hfenergy: -1010.7849279 hartree
pointgroup: C01 [X(C12H17F1N4O3)]
dipole: 0.5363306 -0.6841602 -1.2519895 debye
polarizability: 252.7612425|-16.2944941|134.2393662|16.2906461|21.0405361|158.9943043 unknown
InChI: InChI=1S/C12H17FN4O3/c1-4-16(5-2)10(19)7-17-6-9(13)11(14-8(3)18)15-12(17)20/h6,14H,4-5,7H2,1-3H3
charge 0 multiplicity 1
37 atoms
F  -2.375184 -1.574908 -2.173946
O  2.602942 -1.469826 -1.802798
O  0.564246 0.082365 2.150682
O  -4.037247 1.474209 1.556592
N  3.652877 -0.196289 -0.151735
N  0.376211 -1.278647 0.246653
N  -1.485478 0.102647 0.99673
N  -3.505537 0.104005 -0.30244
C  4.595016 0.353928 -1.163561
C  3.767348 0.325757 1.237699
C  1.763637 -1.75571 0.449781
C  2.719212 -1.111272 -0.579936
C  4.052375 1.632099 -1.836292
C  4.770379 -0.472549 2.097194
C  -0.331473 -1.668758 -0.871209
C  -0.171714 -0.313767 1.202557
C  -1.610391 -1.194263 -1.044608
C  -2.186445 -0.302216 -0.066813
C  -4.357377 0.950134 0.468603
C  -5.723186 1.135984 -0.197071
H  5.554685 0.556512 -0.653018
H  4.761555 -0.425337 -1.926164
H  4.098916 1.377812 1.157443
H  2.771316 0.349879 1.712344
H  1.796599 -2.842799 0.262611
H  2.016882 -1.55258 1.498582
H  3.126452 1.4061 -2.391426
H  3.834315 2.420292 -1.09275
H  4.795916 2.031152 -2.550132
H  4.436208 -1.516962 2.234802
H  5.773905 -0.494772 1.634547
H  4.862439 -0.010292 3.096608
H  0.17075 -2.315944 -1.594232
H  -3.910606 -0.267755 -1.167601
H  -6.331251 1.802887 0.43013
H  -6.249691 0.169083 -0.303898
H  -5.621101 1.584601 -1.202726
