program: Gaussian 09
title: 000296496
version: EM64L-G09RevD.01
frameworkgroup: C1[X(C7H15NO4S)]
method: RPBEPBE
basis: SDD
operation: Freq
keyword: #p
keyword: freq=noraman
keyword: PBEPBE/SDD
title: #p freq=noraman PBEPBE/SDD
converged: YES YES NO NO
title: Mulliken charges:
elementType: S O O O O N C C C C C C C H H H H H H H H H H H H H H H
charge: 1.025998 -0.243454 -0.575005 -0.522426 -0.515855 -0.115430 -0.017573 -0.334393 -0.356479 -0.620674 -0.324192 -0.309891 -0.704006 0.247166 0.208008 0.216356 0.201727 0.218746 0.287983 0.318156 0.220177 0.194352 0.194708 0.219906 0.224867 0.256141 0.227019 0.378068
chargesum: 0.00000
title: Mulliken charges with hydrogens summed into heavy atoms:
elementType: S O O O O N C C C C C C C
charge: 1.025998 -0.243454 -0.196937 -0.522426 -0.515855 -0.115430 0.229592 0.089972 0.063995 -0.014535 0.090337 0.104723 0.004021
polarizability: 1.63866157e+02 -3.97687884e+00 1.07740437e+02 -3.29446461e+00 1.18433622e+00 1.10655026e+02
1716.lowfreq: -27.1477 -8.4424 -4.1865 -0.0009 0.0004 0.0014 24.4137 36.7803 53.1987
frequency: 21.4272 36.6627 53.1200 69.8756 124.9263 167.8659 169.6686 198.6813 212.1824 226.3797 242.6843 247.6890 281.3230 298.0930 311.8386 338.2986 372.5639 409.4591 451.0615 470.0968 489.7044 533.6932 575.4695 611.1279 728.9734 800.1325 834.4880 836.6286 842.7011 873.1898 902.7471 942.7701 963.1795 1021.4979 1025.4925 1038.2444 1050.8489 1058.9145 1081.2812 1095.1063 1125.0366 1129.7714 1160.2115 1189.8135 1196.3817 1230.9704 1248.4232 1273.8801 1295.3680 1320.5203 1340.6764 1342.0733 1356.2853 1370.4568 1376.8490 1392.9290 1409.4810 1443.5920 1448.4573 1451.0118 1457.5735 1469.9274 1482.0690 2888.9816 2904.4622 2957.7241 2961.2417 2991.4014 3016.1182 3035.1014 3038.5077 3061.5074 3084.2702 3087.3295 3089.0663 3092.2202 3164.1763 3496.5431
redmass: 5.6261 4.3996 4.2551 3.4842 6.0539 2.7821 3.9533 2.2940 2.1978 1.3701 1.9087 2.3135 2.5119 4.1168 7.7295 4.6428 2.5771 3.5151 2.7724 3.1072 2.8088 9.9719 5.9384 2.0451 3.0616 4.0035 1.9373 9.0562 1.7375 1.8258 2.1463 4.0591 2.1816 2.1230 1.6378 1.4466 2.0860 1.6656 3.2317 2.1273 2.4093 2.6480 2.4385 1.1037 1.5503 1.1857 1.3421 1.3115 1.3422 1.2736 1.2258 1.3003 1.3940 1.2706 1.3336 1.1873 1.1205 1.0819 1.0784 1.0970 1.0987 1.0558 1.0447 1.0692 1.0681 1.0663 1.0664 1.0361 1.0850 1.0909 1.0919 1.0567 1.0965 1.0983 1.0994 1.1001 1.1105 1.0665
irintensity: 2.7793 0.7081 3.7545 0.7761 5.2434 25.7126 6.2875 3.5133 30.1891 4.8678 14.3908 13.1158 23.9944 45.6479 12.4629 28.9570 31.8680 14.1166 12.7312 15.8377 4.4726 149.1699 19.5230 28.4453 9.0151 10.5539 1.5071 44.5217 3.9816 18.0871 3.8369 71.7095 50.1053 2.5803 25.0389 40.6854 35.8215 30.3596 25.4871 29.5085 44.4463 24.4350 72.6206 5.3392 7.3335 8.5307 18.7130 2.0043 1.8983 8.6003 8.9949 6.7483 8.1916 1.4729 4.6891 28.9021 10.3983 2.9423 0.9424 22.3469 11.4228 6.2293 17.7382 67.7831 75.0397 26.5980 100.4093 11.0861 2.0546 35.1128 26.9111 3.3842 35.1033 34.1026 20.4546 20.2273 0.4597 49.2988
temp: 298.150 k
press: 1.00000 atm
elementType: 16 8 8 8 8 7 6 6 6 6 6 6 6 1 1 1 1 1 1 1 1 1 1 1 1 1 1 1
symmnumber: 1
zpe: 588505.9 jmol-1
zpe.correction: 0.224150 hartree
zpe.thermalcorrener: 0.239493 hartree
zpe.thermalcorrenthalpy: 0.240437 hartree
zpe.thermalcorrgfe: 0.180407 hartree
zpe.sumelectzpe: -1028.176929 hartree
zpe.sumelectthermal: -1028.161585 hartree
zpe.sumelectthermalent: -1028.160641 hartree
zpe.sumelectthermalfe: -1028.220671 hartree
dipole: -2.2548 -1.0704 -0.1136
dipole: 2.4986
quadrupole: -103.6677 -87.3772 -86.8000
quadrupole: -8.3969 -0.7355 0.8505
quadrupole: -11.0528 5.2378 5.8150 -8.3969 -0.7355 0.8505
hfenergy: -1028.4010786 hartree
pointgroup: C01 [X(C7H15N1O4S1)]
dipole: 0.913798 0.1907679 -0.3080781 debye
polarizability: 162.6693093|0.9420229|108.7938958|9.4261734|1.9509426|110.7984148 unknown
InChI: InChI=1S/C7H15NO4S/c1-7(6-13(9,10)11)8-2-4-12-5-3-8/h7,9H,2-6H2,1H3
charge 0 multiplicity 1
28 atoms
S  -2.980983 0.095717 -0.420581
O  4.027286 0.125427 -0.120674
O  -3.422405 1.237052 -1.839689
O  -3.297251 0.825338 0.991311
O  -3.609478 -1.371627 -0.700882
N  1.142625 0.138136 0.080501
C  -0.269405 -0.110958 0.474765
C  1.856572 -0.985605 -0.578287
C  1.982205 0.768942 1.13201
C  -1.084416 0.178474 -0.801526
C  3.181997 -0.471551 -1.167572
C  3.311461 1.241574 0.518019
C  -0.559405 -1.493343 1.109665
H  -0.534558 0.669435 1.213753
H  1.235106 -1.401233 -1.393166
H  2.079293 -1.810222 0.13892
H  2.199805 0.058041 1.965895
H  1.444363 1.638888 1.552462
H  -0.967429 -0.561388 -1.608988
H  -0.948169 1.20746 -1.163408
H  3.775988 -1.29897 -1.589268
H  2.971538 0.281416 -1.957286
H  3.11191 2.03706 -0.231854
H  3.99343 1.624704 1.294733
H  -0.467919 -2.315538 0.378201
H  -1.579312 -1.52877 1.531045
H  0.147983 -1.681542 1.936862
H  -4.419332 1.258079 -1.916663
