program: Gaussian 09
title: 000296490
version: EM64L-G09RevD.01
frameworkgroup: C1[X(C10H8ClF3N2O2)]
method: RPBEPBE
basis: SDD
operation: Freq
keyword: #p
keyword: freq=noraman
keyword: PBEPBE/SDD
title: #p freq=noraman PBEPBE/SDD
converged: YES YES NO NO
title: Mulliken charges:
elementType: Cl F F F O O N N C C C C C C C C C C H H H H H H H H
charge: -0.035478 -0.163781 -0.159488 -0.160742 -0.216502 -0.203583 -0.189667 0.077042 0.293659 0.297574 -0.465425 -0.329415 0.196727 -0.288984 -0.317041 -0.226776 0.264497 -0.576063 0.299159 0.269051 0.271944 0.262879 0.271016 0.248237 0.280704 0.300455
chargesum: 0.00000
title: Mulliken charges with hydrogens summed into heavy atoms:
elementType: Cl F F F O O N N C C C C C C C C C C
charge: -0.035478 -0.163781 -0.159488 -0.160742 -0.216502 -0.203583 -0.189667 0.077042 0.293659 0.297574 -0.166266 0.211580 0.196727 -0.026105 -0.046024 0.021461 0.264497 0.005096
polarizability: 2.11418820e+02 6.55264209e+00 1.45681763e+02 2.22886607e+00 6.76492498e+00 7.82141363e+01
1716.lowfreq: -9.5780 -6.7259 -0.0012 -0.0011 -0.0004 4.2363 15.3699 23.6751 25.4672
frequency: 14.9084 23.3748 25.3968 41.5393 69.1234 104.1760 122.4208 125.4260 132.9017 181.7958 194.2450 230.9227 252.7721 300.1450 326.1468 337.2058 351.6027 384.9254 413.0929 420.7426 440.5693 459.4701 516.2553 541.6683 591.6510 608.5773 661.5505 690.3979 694.2027 716.8102 730.4315 763.2660 800.4945 814.0132 882.8879 930.6233 937.5665 948.8183 989.4809 991.2600 993.6199 1022.6444 1036.1867 1049.6394 1056.7362 1110.9473 1145.1505 1197.2520 1208.0523 1260.0761 1264.8209 1304.1288 1312.0479 1327.3390 1358.8496 1379.0855 1390.0686 1432.9410 1435.8145 1454.0365 1475.4712 1570.1764 1597.3880 1618.8601 3046.6799 3072.7720 3121.6152 3154.6035 3162.8204 3171.4983 3173.3444 3194.9768
redmass: 16.6250 7.7524 11.7332 9.0672 2.6414 8.4574 6.9854 7.9709 8.6760 6.9957 10.4096 8.9186 7.9215 6.2865 8.9488 2.9971 7.3274 9.7426 4.1083 7.5974 9.7345 8.7172 11.9213 7.7237 7.5261 11.6692 6.7314 2.2022 6.5570 4.5143 3.8938 1.6647 4.5900 1.7516 2.7259 1.4301 2.7437 2.4394 5.5978 1.5794 5.0793 6.0328 1.7191 3.2803 4.0335 1.8940 2.1619 1.0910 1.6725 2.8993 1.1890 2.7098 1.2998 1.5206 1.3759 6.7188 8.4443 2.9561 1.1988 1.0915 2.4768 8.7772 6.8283 6.4026 1.0593 1.0558 1.1047 1.0882 1.1129 1.0931 1.0949 1.0962
irintensity: 0.2010 0.6910 0.3843 0.2770 1.6138 1.8374 0.7266 7.5389 1.1982 0.4492 4.4235 5.3834 2.7245 3.0255 15.3596 1.1390 7.1783 8.4942 8.0135 4.0806 4.7035 4.2977 3.2494 15.8927 15.6868 25.3832 12.9138 23.8228 59.8543 11.3257 70.7973 101.2446 36.4347 42.1801 88.2496 16.6119 82.2866 13.5498 5.6685 33.8139 176.6398 139.7654 51.2112 18.1314 154.5376 3.8629 37.1389 9.8330 74.7259 406.5445 6.3157 73.7957 5.6413 85.3229 53.0297 119.9191 0.0681 10.6375 30.5146 11.4379 4.5109 96.3680 37.9038 34.6564 2.0801 10.8446 0.8573 2.7909 1.5710 0.2709 6.8753 2.5912
temp: 298.150 k
press: 1.00000 atm
elementType: 17 9 9 9 8 8 7 7 6 6 6 6 6 6 6 6 6 6 1 1 1 1 1 1 1 1
symmnumber: 1
zpe: 447777.2 jmol-1
zpe.correction: 0.170549 hartree
zpe.thermalcorrener: 0.187808 hartree
zpe.thermalcorrenthalpy: 0.188752 hartree
zpe.thermalcorrgfe: 0.121269 hartree
zpe.sumelectzpe: -1404.028725 hartree
zpe.sumelectthermal: -1404.011466 hartree
zpe.sumelectthermalent: -1404.010522 hartree
zpe.sumelectthermalfe: -1404.078005 hartree
dipole: 0.3103 3.3451 -0.7626
dipole: 3.4449
quadrupole: -131.4313 -111.6971 -110.7532
quadrupole: 9.5757 0.4423 -6.9989
quadrupole: -13.4708 6.2635 7.2074 9.5757 0.4423 -6.9989
hfenergy: -1404.1992742 hartree
pointgroup: C01 [X(C10H8Cl1F3N2O2)]
dipole: -0.1171596 -1.3113698 0.321768 debye
dipolederiv: -0.5917211 -0.1825887 0.1079388 -0.1443274 -0.2290196 0.0177978 0.1253618 0.0323413 -0.188532 -0.7928579 0.0865703 0.2440696 0.0958129 -0.3206235 0.026928 0.2154956 0.0288703 -0.5186474 -0.4219303 -0.0114467 -0.0396483 0.0271744 -0.8183144 -0.0129835 -0.0603947 0.030051 -0.289444 -0.6246012 0.0977256 -0.2673781 0.1176862 -0.3585364 -0.0429865 -0.3446515 -0.016747 -0.7362603 -0.8042963 -0.1168461 -0.0037513 -0.1420212 -0.6103395 0.3252097 -0.0800421 0.261257 -0.6256444 -0.6740999 0.4546282 -0.6944455 0.1199109 -0.3173003 0.2510858 -0.1819513 0.2500978 -0.5422733 -0.8298848 0.0631004 -0.21628 0.3193084 -0.5062942 0.4622942 -0.733516 0.4281418 -0.824769 0.2163693 -0.3454248 0.4939833 -0.3912782 0.4048895 -0.6990304 0.5198393 -0.6374881 1.0280702 -0.6351164 -0.103519 0.0355788 -0.1325287 -0.1057119 0.0601754 0.0745214 0.0591715 -0.0546203 -0.3446385 0.0327811 -0.0035757 0.1110141 -0.2652433 0.0236333 0.0474728 -0.0120766 -0.1523169 0.1717584 0.0209348 -0.0207442 -0.0727365 -0.0207912 -0.0152172 0.0700362 -0.0093477 -0.058188 0.2145549 0.0323694 -0.0363325 0.1357015 0.1053717 0.0900088 -0.0105731 0.0362326 0.095618 2.190771 0.0136448 0.3873778 -0.0003946 0.6446652 -0.4548927 0.3871089 -0.3730567 0.7114082 0.1777447 -0.0761984 0.0155836 0.1526586 0.0175815 -0.0173289 -0.0970094 -0.0641196 -0.0483028 0.0817563 0.0550839 -0.0333304 -0.1006378 0.0610866 -0.0453325 0.0057201 -0.0382555 -0.0635291 -0.3366637 0.0728785 -0.0319503 0.1179444 0.1269131 -0.0874553 -0.0392142 -0.107238 -0.0959597 1.9551559 -0.3099135 0.10071 -0.4595714 1.5603517 0.0194747 0.2080125 -0.0292929 1.5434376 0.7127041 0.2140705 -0.1423877 0.2474407 0.2355478 -0.08296 -0.1134418 -0.0325574 0.1633307 0.1557664 -0.0336336 0.0188996 -0.0175842 0.070757 0.0203211 -0.0133365 0.0351124 0.1403806 0.0238295 0.0143728 0.0235579 0.0315259 0.0039449 0.0005338 -0.0535267 0.0383526 0.1036818 0.0860627 -0.0264815 -0.0268883 -0.0605718 0.0878221 0.0104667 -0.0167461 -0.0291336 -0.0091695 0.0444063 0.0749141 -0.0020756 0.0983583 0.0800115 0.0182246 -0.0006391 0.0428883 0.1249909 -0.0061948 -0.0355263 0.0208406 -0.0263916 0.1135894 0.0140822 0.0225936 0.0178766 0.1480852 0.0671848 -0.0208435 0.0107586 -0.0330503 -0.0452342 0.0654727 0.026116 0.0685719 0.135477 -0.0021743 -0.0353154 0.0420347 -0.0196747 0.0729499 0.0435245 0.0140485 -0.0209009 -0.0674077 -0.033885 0.0646632 0.0174546 0.0262322 0.0119267 0.0089539 0.0287157 0.041249 0.0805843 unknown
polarizability: 211.4420849|7.3475551|126.635293|0.2868339|-30.9708902|97.2373413 unknown
InChI: InChI=1S/C10H8ClF3N2O2/c11-4-5-16(15-18)9(17)7-2-1-3-8(6-7)10(12,13)14/h1-3,6H,4-5H2
charge 0 multiplicity 1
26 atoms
Cl 5.945725 1.491225 -0.48932
F  -4.763443 0.809865 0.457553
F  -3.323791 2.303527 -0.46982
F  -4.299814 0.712715 -1.755502
O  1.364642 0.967247 -1.365905
O  3.307236 -1.587416 1.852053
N  2.365973 -0.508657 0.102723
N  2.206944 -1.254004 1.313651
C  -0.16804 -0.474361 -0.178019
C  -2.567646 0.009081 -0.196302
C  -1.241987 0.418542 -0.431128
C  3.714702 -0.15658 -0.414974
C  1.194548 0.042641 -0.522837
C  -0.44656 -1.789472 0.279319
C  -2.846636 -1.299915 0.267236
C  -1.781444 -2.194579 0.493391
C  -3.709552 0.946042 -0.480555
C  4.222343 1.162762 0.191483
H  -1.020961 1.421763 -0.807512
H  4.394795 -0.982516 -0.146844
H  3.640401 -0.063229 -1.509017
H  0.365063 -2.495349 0.464252
H  -3.880509 -1.608856 0.450448
H  -1.990257 -3.21026 0.842062
H  4.333815 1.108489 1.283668
H  3.604556 2.017994 -0.114003
