program: Gaussian 09
title: 000296480
version: EM64L-G09RevD.01
frameworkgroup: C1[X(C11H11N5O)]
method: RPBEPBE
basis: SDD
operation: Freq
keyword: #p
keyword: freq=noraman
keyword: PBEPBE/SDD
title: #p freq=noraman PBEPBE/SDD
converged: YES YES NO NO
title: Mulliken charges:
elementType: O N N N N N C C C C C C C C C C C H H H H H H H H H H H
charge: -0.249537 -0.360188 -0.129652 -0.084199 -0.146107 -0.082255 0.139330 0.178072 0.309647 0.346037 -0.362210 -0.370121 -0.606936 -0.617141 -0.224168 -0.237695 -0.234304 0.276724 0.269228 0.229886 0.242720 0.274157 0.279946 0.237343 0.237272 0.229147 0.225706 0.229297
chargesum: 0.00000
title: Mulliken charges with hydrogens summed into heavy atoms:
elementType: O N N N N N C C C C C C C C C C C
charge: -0.249537 -0.360188 -0.129652 -0.084199 -0.146107 -0.082255 0.139330 0.178072 0.309647 0.346037 -0.085485 -0.100893 0.139827 0.137420 0.004979 -0.011989 -0.005006
polarizability: 2.54737947e+02 -1.13050650e+00 1.67914143e+02 -4.16117694e-01 -8.69456944e-01 7.05044885e+01
1716.lowfreq: -11.6157 0.0004 0.0008 0.0009 0.5654 2.4825 37.5745 40.4433 65.8726
frequency: 37.3555 40.4146 65.8413 76.4408 83.1820 98.8615 117.0501 180.3107 210.9709 226.1224 263.3300 307.4499 335.2403 345.6533 359.9176 405.0218 453.5179 502.1634 544.3879 613.4875 620.4659 629.0879 646.5385 667.7710 696.6984 703.2548 748.7930 772.7723 779.9411 824.9151 861.2303 909.3592 938.0853 955.2180 980.2151 988.0706 989.0643 1002.9368 1028.0301 1068.9659 1080.4030 1093.2591 1096.1102 1138.4925 1144.8205 1173.2704 1177.8420 1195.0898 1240.7014 1276.7290 1308.3999 1328.8054 1352.6293 1383.7080 1433.4953 1440.0173 1442.2812 1449.3394 1464.9969 1468.9270 1475.7730 1482.4934 1490.0609 1531.0856 1586.2587 1620.0315 1671.3136 2975.2135 2979.3556 3056.8474 3067.2629 3119.4081 3127.1476 3137.4107 3137.7829 3151.2044 3160.6553 3170.2597
redmass: 1.7246 3.2594 1.5881 2.1859 2.0134 3.4343 4.0677 3.7526 3.8548 6.5050 4.6416 8.5688 3.1877 6.3955 7.8457 2.8577 4.9217 3.9080 4.8955 6.7349 9.4236 10.6790 10.3726 7.0869 6.7327 1.8826 9.8303 12.7830 1.9012 12.2616 1.2454 11.7066 1.4255 3.6540 10.4038 6.2115 1.3811 1.3232 2.2634 1.4279 1.7776 1.7950 2.0599 2.5042 1.5620 1.1009 3.5046 1.1860 4.6597 4.1570 7.9270 1.6354 3.9519 8.9321 1.1749 2.5840 1.2268 2.5172 1.1114 2.2282 1.1456 1.0897 1.2305 5.7300 6.1661 5.9433 6.7615 1.0382 1.0387 1.0999 1.0977 1.1008 1.0850 1.0979 1.0888 1.0933 1.0966 1.1006
irintensity: 0.2848 1.5351 0.1673 1.0746 1.2143 0.1958 0.1401 0.0680 7.8345 4.9701 0.5601 0.2391 6.8044 4.1736 0.0038 0.0120 2.9137 4.7470 0.1352 1.2965 5.5522 13.5207 0.4370 21.6202 22.6806 46.4051 16.3889 1.9842 47.2200 54.3862 0.0005 54.9670 6.3879 14.0054 35.7778 0.8373 0.0216 0.6597 7.0026 13.2724 2.5001 13.1218 9.5437 36.7180 49.7683 0.3698 2.2902 6.5240 33.7577 9.8493 15.5650 4.8099 34.3687 3.5315 36.6590 12.0693 49.5700 20.2858 55.9554 242.2883 42.7805 24.0424 26.1589 3.1143 2.2915 4.6250 677.5921 29.9617 118.6278 33.5886 20.6390 5.6552 0.2489 3.2344 14.2989 13.1119 15.1899 22.5051
temp: 298.150 k
press: 1.00000 atm
elementType: 8 7 7 7 7 7 6 6 6 6 6 6 6 6 6 6 6 1 1 1 1 1 1 1 1 1 1 1
symmnumber: 1
zpe: 554511.1 jmol-1
zpe.correction: 0.211202 hartree
zpe.thermalcorrener: 0.226147 hartree
zpe.thermalcorrenthalpy: 0.227091 hartree
zpe.thermalcorrgfe: 0.167418 hartree
zpe.sumelectzpe: -773.455249 hartree
zpe.sumelectthermal: -773.440304 hartree
zpe.sumelectthermalent: -773.439360 hartree
zpe.sumelectthermalfe: -773.499032 hartree
dipole: -4.8978 -6.4546 0.0976
dipole: 8.1030
quadrupole: -64.6961 -108.3668 -101.8034
quadrupole: 5.7074 -0.4911 0.1421
quadrupole: 26.9260 -16.7447 -10.1813 5.7074 -0.4911 0.1421
hfenergy: -773.6664508 hartree
pointgroup: C01 [X(C11H11N5O1)]
dipole: 1.8282167 2.610406 -0.0814661 debye
polarizability: 254.6612134|2.3063611|167.7644806|2.5107309|-4.3885963|70.7308844 unknown
InChI: InChI=1S/C11H11N5O/c1-15(2)11-14-16-9(12-13-10(16)17-11)8-6-4-3-5-7-8/h3-7H,1-2H3
charge 0 multiplicity 1
28 atoms
O  2.64673 -1.079408 0.157063
N  0.489143 -0.439766 0.094436
N  3.617808 1.098175 0.00827
N  1.210096 0.792558 0.05403
N  -0.727124 -2.302738 0.186995
N  0.658523 -2.704681 0.22338
C  -0.813428 -0.931839 0.111586
C  1.317898 -1.542771 0.16392
C  2.486042 0.351155 0.077366
C  -2.046995 -0.148973 0.060285
C  -3.297572 -0.826462 0.074389
C  -2.017403 1.27189 -0.001174
C  3.491261 2.564179 -0.08036
C  4.95558 0.513944 0.20778
C  -4.497747 -0.091173 0.0275
C  -3.22603 1.998622 -0.047746
C  -4.468438 1.323615 -0.033836
H  -3.302367 -1.91992 0.122145
H  -1.05665 1.796919 -0.010836
H  4.290479 2.956451 -0.732733
H  3.575737 3.036662 0.917564
H  2.511331 2.823649 -0.509618
H  4.893421 -0.583218 0.196485
H  5.384806 0.837059 1.175972
H  5.627633 0.841748 -0.605683
H  -5.457874 -0.6187 0.038578
H  -3.19841 3.093034 -0.094386
H  -5.404249 1.89229 -0.070072
