program: Gaussian 09
title: 000296528
version: EM64L-G09RevD.01
frameworkgroup: C1[X(C20H22N4O6)]
method: RPBEPBE
basis: SDD
operation: Freq
keyword: #p
keyword: freq=noraman
keyword: PBEPBE/SDD
title: #p freq=noraman PBEPBE/SDD
converged: YES YES NO NO
title: Mulliken charges:
elementType: O O O O O O N N N N C C C C C C C C C C C C C C C C C C C C H H H H H H H H H H H H H H H H H H H H H H
charge: -0.489682 -0.489677 -0.303605 -0.303600 -0.304503 -0.304516 -0.419168 -0.419172 -0.136671 -0.136677 -0.127278 -0.127301 0.122759 0.122743 0.338279 0.338283 -0.011781 -0.011763 -0.518590 -0.518603 -0.503294 -0.503276 0.248773 0.248779 0.230886 0.230878 -0.528395 -0.528400 -0.527880 -0.527874 0.251854 0.251860 0.354183 0.354196 0.264554 0.264555 0.270107 0.270105 0.380273 0.380268 0.257514 0.228806 0.220426 0.257524 0.228805 0.220428 0.228876 0.222023 0.251541 0.251521 0.228881 0.222027
chargesum: 0.00000
title: Mulliken charges with hydrogens summed into heavy atoms:
elementType: O O O O O O N N N N C C C C C C C C C C C C C C C C C C C C
charge: -0.109410 -0.109409 -0.303605 -0.303600 -0.304503 -0.304516 -0.064985 -0.064976 -0.136671 -0.136677 0.124576 0.124559 0.122759 0.122743 0.338279 0.338283 -0.011781 -0.011763 -0.254036 -0.254047 -0.233187 -0.233171 0.248773 0.248779 0.230886 0.230878 0.178351 0.178358 0.174560 0.174555
polarizability: 3.10879480e+02 3.47735943e-04 2.85215087e+02 1.93634884e+01 -3.16798886e-03 2.31949091e+02
1716.lowfreq: -0.0003 0.0006 0.0007 3.9316 4.8401 6.3636 10.3831 23.9700 30.5710
frequency: 10.1220 23.9557 30.5283 46.3537 58.5212 82.3591 88.7656 94.2343 99.6182 110.9326 115.2678 119.8672 131.4040 153.8697 154.5000 159.3970 162.2981 169.4464 173.2290 199.1059 219.0754 240.6290 243.8461 260.0537 272.0241 284.0325 297.7114 313.5223 316.8463 361.6757 362.8354 380.4945 393.7439 411.1106 413.1260 425.0280 427.7261 449.5064 483.8761 491.9314 519.3841 542.6073 576.0248 599.6825 603.6366 629.0787 639.1586 643.8733 668.5992 700.4374 700.8573 705.1826 730.8973 731.3817 748.2689 748.7323 754.7908 754.8732 764.4436 766.8531 828.1307 837.3919 867.2950 867.5400 877.2098 890.2436 890.7107 924.0722 924.3144 938.9827 949.5792 953.3548 982.9837 1014.4525 1021.1201 1065.2315 1088.1544 1094.4782 1111.3677 1111.6240 1113.6036 1113.6646 1137.2011 1138.4397 1151.4551 1152.2563 1158.4756 1158.6064 1180.9642 1183.6585 1210.6020 1211.0997 1216.5585 1224.4246 1238.7221 1238.7853 1283.4271 1298.8664 1305.5648 1309.5149 1364.1178 1367.0699 1378.5198 1385.2062 1419.7052 1420.0877 1424.3856 1424.6578 1433.4956 1436.2714 1452.4516 1453.0075 1456.6705 1456.6896 1460.9855 1461.4012 1469.8614 1469.8956 1478.4794 1478.4965 1486.8798 1486.9149 1515.6299 1523.4483 1575.2911 1575.8819 1642.8324 1643.3666 2966.0564 2968.9496 2969.1133 2972.2817 2972.3984 2977.2482 3065.9288 3065.9513 3071.8244 3071.8511 3119.0325 3119.0783 3122.0614 3122.0892 3168.4036 3168.4078 3178.0495 3178.0719 3286.5486 3286.9844 3530.3021 3531.1796
redmass: 5.9186 4.4417 4.5066 4.5851 3.8749 3.9631 5.7985 2.8852 2.8803 4.2190 4.1962 4.2189 4.6202 4.1472 1.9641 1.2087 1.3380 1.1166 1.2985 3.6758 5.4928 4.9798 5.2913 6.5420 6.2148 5.8415 5.7679 6.4516 6.4085 5.7541 6.9498 5.1537 6.5953 5.8782 4.9011 4.7664 4.3145 5.3097 4.2122 4.5174 4.7615 4.3742 1.8504 2.1476 1.8170 2.3971 4.4090 5.0979 4.4887 6.5777 6.4792 6.8798 6.3110 6.1798 1.8945 2.2753 4.3862 5.3893 1.5922 1.4641 4.6420 3.8524 1.6831 1.6287 4.6979 1.5463 1.5435 7.7443 7.6236 6.1026 4.8540 4.8752 7.8376 6.0970 4.8352 3.5107 5.0865 4.4254 1.2580 1.2546 1.2435 1.2448 1.6688 1.6274 1.4523 1.4680 1.4915 1.4965 2.3615 2.3868 2.0565 1.7900 1.5468 1.8078 1.1532 1.1954 1.5233 1.9502 8.2704 2.0421 3.7161 3.7940 2.6492 2.4568 1.4099 1.3989 1.2694 1.2677 2.9442 2.8940 1.7886 1.7179 1.0661 1.0668 1.3879 1.4651 2.5368 2.5593 1.1424 1.1439 1.0538 1.0536 4.6806 4.5265 9.6765 9.6637 8.1391 8.1409 1.0817 1.0309 1.0309 1.0315 1.0316 1.0851 1.1039 1.1039 1.1028 1.1028 1.1025 1.1025 1.1031 1.1031 1.0932 1.0932 1.0932 1.0932 1.0646 1.0654 1.0823 1.0822
irintensity: 0.1238 0.3760 3.4071 1.3512 0.5351 4.5196 2.4634 6.4948 7.4783 1.2248 13.0187 1.5662 3.4696 0.2048 3.7660 0.1200 5.2246 0.0472 6.7917 0.0000 21.4397 8.9601 7.7180 3.8727 25.9643 7.0410 9.2589 0.0518 2.2856 3.8443 1.3932 4.7962 18.9861 2.3708 13.8717 1.0422 4.5801 2.9930 25.2292 1.7841 22.3152 41.9286 24.6749 98.5389 48.0364 38.3997 61.7293 5.9392 0.7902 4.4061 4.7330 0.9693 12.8461 5.8325 65.8917 64.4880 6.4236 6.5344 103.8981 160.7652 16.8401 1.9792 24.3889 31.0004 4.1340 39.3186 20.8150 84.3201 24.9692 0.2223 80.0449 102.1955 65.0297 42.0962 7.0292 44.2159 65.2220 20.6173 26.8172 23.4104 12.4300 2.7067 92.1930 60.3889 0.4668 6.7363 29.9743 33.3365 93.5283 4.9459 9.1174 11.3259 31.0603 71.8497 5.3964 7.5349 65.2697 35.3621 14.1644 75.9840 178.8727 48.5391 275.5593 83.8062 12.4372 66.4405 3.8930 0.0247 80.6922 138.6607 42.0973 39.9516 29.2399 7.0260 16.3118 8.5509 11.9892 38.7240 4.5267 6.8952 18.0168 24.3710 17.8081 3.9442 23.7590 25.5542 1.0393 18.6921 17.0240 29.1827 127.6947 149.6165 6.3100 61.4594 30.3545 25.3068 20.4816 28.3872 44.5025 11.1981 24.8311 24.0270 2.8767 0.4256 1.3307 0.7478 246.0535 89.2971 89.5558 256.7267
temp: 298.150 k
press: 1.00000 atm
elementType: 8 8 8 8 8 8 7 7 7 7 6 6 6 6 6 6 6 6 6 6 6 6 6 6 6 6 6 6 6 6 1 1 1 1 1 1 1 1 1 1 1 1 1 1 1 1 1 1 1 1 1 1
symmnumber: 1
zpe: 1053186.1 jmol-1
zpe.correction: 0.401137 hartree
zpe.thermalcorrener: 0.429713 hartree
zpe.thermalcorrenthalpy: 0.430657 hartree
zpe.thermalcorrgfe: 0.340453 hartree
zpe.sumelectzpe: -1443.430088 hartree
zpe.sumelectthermal: -1443.401513 hartree
zpe.sumelectthermalent: -1443.400569 hartree
zpe.sumelectthermalfe: -1443.490773 hartree
dipole: -0.0009 -1.6631 0.0000
dipole: 1.6631
quadrupole: -155.1055 -164.4420 -177.0723
quadrupole: -0.0057 14.3475 0.0025
quadrupole: 10.4344 1.0980 -11.5324 -0.0057 14.3475 0.0025
hfenergy: -1443.8312259 hartree
pointgroup: C01 [X(C20H22N4O6)]
dipole: 0.0005935 0.6542967 0.0009407 debye
polarizability: 314.4437382|-0.0278838|285.2149867|-8.9949013|0.0955427|228.384933 unknown
InChI: InChI=1S/C20H22N4O6/c1-27-13-5-9-10(6-14(13)28-2)22-19(21-9)17(25)18(26)20-23-11-7-15(29-3)16(30-4)8-12(11)24-20/h5-8,17-18,21,23,25-26H,1-4H3
charge 0 multiplicity 1
52 atoms
O  0.152322 -3.361503 -1.880121
O  -0.215992 -3.367008 1.841563
O  -5.554655 1.884721 0.729288
O  5.505009 1.871743 -0.751884
O  -5.030821 2.22134 -2.089907
O  4.982131 2.201171 2.068438
N  -2.217943 -1.809093 0.557722
N  2.158874 -1.813959 -0.591358
N  -1.8115 -1.557097 -1.671216
N  1.753077 -1.567695 1.638341
C  -0.555005 -3.407365 -0.593667
C  0.491172 -3.410908 0.554938
C  -1.513219 -2.243307 -0.552888
C  1.452945 -2.249652 0.517908
C  -3.036555 -0.7473 0.140562
C  2.980366 -0.755692 -0.170935
C  -2.771894 -0.601907 -1.266753
C  2.7161 -0.613902 1.236821
C  -3.966583 0.064973 0.817219
C  3.912463 0.056227 -0.845152
C  -3.432352 0.40044 -2.010582
C  3.37917 0.384483 1.983659
C  -4.633768 1.045999 0.058809
C  4.582145 1.033287 -0.083821
C  -4.349819 1.228599 -1.341076
C  4.298681 1.212363 1.31662
C  -6.959193 1.748564 0.273276
C  6.909232 1.731145 -0.296235
C  -4.67387 3.611367 -1.720297
C  4.628442 3.593187 1.703204
H  -1.12392 -4.357005 -0.517503
H  1.057089 -4.362075 0.475676
H  -2.043312 -2.186996 1.492605
H  1.983102 -2.188379 -1.52743
H  -4.200328 -0.037787 1.880284
H  4.14591 -0.043894 -1.908534
H  -3.241566 0.549743 -3.07634
H  3.188772 0.531084 3.049861
H  -0.408508 -2.753947 -2.456418
H  0.346554 -2.762767 2.419679
H  -7.042695 1.958291 -0.807834
H  -7.528672 2.487036 0.857857
H  -7.330124 0.728659 0.490421
H  6.993167 1.937579 0.785469
H  7.480363 2.470014 -0.878697
H  7.277905 0.711044 -0.516287
H  -5.286293 4.254509 -2.370702
H  -3.599541 3.79276 -1.914949
H  -4.902451 3.805608 -0.656678
H  4.857494 3.790264 0.640205
H  5.242361 4.232839 2.355638
H  3.554538 3.776499 1.898404
