program: Gaussian 09
title: 000296492
version: EM64L-G09RevD.01
frameworkgroup: C1[X(C12H15ClN2O5)]
method: RPBEPBE
basis: SDD
operation: Freq
keyword: #p
keyword: freq=noraman
keyword: PBEPBE/SDD
title: #p freq=noraman PBEPBE/SDD
converged: YES YES NO NO
title: Mulliken charges:
elementType: Cl O O O O O N N C C C C C C C C C C C C H H H H H H H H H H H H H H H
charge: -0.046116 -0.303973 -0.282294 -0.305383 -0.225861 -0.218597 -0.191588 0.075345 0.365842 0.062637 0.254306 0.254211 -0.527459 -0.462786 0.183639 -0.329395 -0.576614 -0.524003 -0.522550 -0.526450 0.294430 0.275888 0.267192 0.268651 0.279808 0.301709 0.232391 0.236694 0.262971 0.217383 0.261329 0.234933 0.247347 0.231008 0.235354
chargesum: 0.00000
title: Mulliken charges with hydrogens summed into heavy atoms:
elementType: Cl O O O O O N N C C C C C C C C C C C C
charge: -0.046116 -0.303973 -0.282294 -0.305383 -0.225861 -0.218597 -0.191588 0.075345 0.365842 0.062637 0.254306 0.254211 -0.233029 -0.186898 0.183639 0.206449 0.004903 0.208053 0.191096 0.187259
polarizability: 2.79472741e+02 -2.43890127e+00 1.84361910e+02 5.68587431e+00 5.45718807e+00 1.07020480e+02
1716.lowfreq: -6.2513 -0.0008 0.0005 0.0016 2.6115 7.5079 23.2522 27.6144 35.3767
frequency: 23.1758 27.5704 35.3277 55.7999 73.6680 78.1922 80.4947 94.9927 107.3239 122.5706 127.5232 149.4209 159.3420 170.3884 176.0745 190.8719 201.1868 224.9259 242.5605 254.9576 283.8291 314.5993 324.2045 350.1380 368.4132 389.8355 424.2314 443.6213 473.8436 517.7374 539.3600 570.4482 605.3903 627.9995 689.0967 692.8021 737.4640 741.9078 771.6311 786.5870 822.5794 863.5877 879.0344 893.8853 912.7826 930.2978 940.8749 1012.1750 1039.3985 1041.1615 1053.6372 1102.5283 1110.5749 1112.1655 1113.3743 1148.1539 1152.4997 1158.4971 1179.3963 1206.9227 1218.9739 1251.6717 1266.2302 1307.1964 1324.0222 1357.2286 1363.6412 1367.9452 1394.3205 1414.3765 1434.7885 1436.1041 1437.3067 1454.2358 1454.5820 1457.8410 1460.6449 1464.1201 1475.4707 1483.4712 1485.8164 1551.2951 1582.2684 1599.9416 2976.1334 2980.6476 2985.7114 3047.4770 3073.7084 3073.8693 3088.6879 3089.5163 3123.7377 3126.1993 3131.0485 3133.6838 3165.0649 3177.9787 3200.0477
redmass: 8.7273 6.9057 6.5183 4.7390 3.1379 2.6150 2.7516 3.1070 4.7459 3.3585 6.5189 1.1106 1.4635 1.1020 4.4680 8.4258 3.9604 3.9669 6.9840 5.2382 6.1573 5.7321 4.2043 3.2581 6.0137 8.0019 7.3154 10.8180 7.5927 5.9389 7.4623 5.4496 5.2867 4.7783 5.0669 6.4831 2.1702 4.8808 4.6621 2.1342 6.6068 3.6487 2.1237 2.8244 1.6584 6.9471 7.8626 5.3219 2.4040 2.4410 3.8484 2.2044 1.2645 1.3202 1.2465 1.3606 1.3625 1.4547 3.1067 1.6541 1.4734 2.8326 1.1720 3.8008 1.4348 1.5751 6.4769 3.9663 2.9090 1.3382 1.2461 1.1471 1.4132 1.4576 1.1435 1.0893 1.0680 1.3806 1.0629 1.0539 1.0538 7.9498 10.1370 6.8049 1.0304 1.0339 1.0295 1.0592 1.1050 1.0559 1.1038 1.1005 1.1045 1.1026 1.1039 1.1045 1.1128 1.0919 1.0922
irintensity: 0.3583 0.9624 0.0919 2.3420 1.0550 3.0023 2.0275 8.6069 1.9942 4.7436 9.6045 0.4765 1.4526 0.3089 4.4786 4.2217 2.3926 4.8789 1.2555 26.1688 9.5385 2.0377 4.8080 5.0921 9.7660 14.9055 3.9977 15.9706 4.2553 1.8580 17.0201 2.0504 11.1445 13.7006 55.1421 42.2089 3.6990 42.4273 13.5096 136.1890 10.3281 8.8028 11.7915 118.7422 31.0805 161.4624 57.2395 125.8932 26.3316 112.9501 2.6546 76.0171 9.9223 3.9897 2.6725 4.6004 2.0718 15.4087 37.1437 1.5517 18.8756 13.7938 8.2991 499.8166 178.3016 91.3963 18.8644 100.0593 70.0810 7.5659 54.7144 39.3146 14.5757 47.7593 7.4115 20.4747 6.8151 12.1737 6.3006 15.9036 31.9140 163.6784 124.1331 9.3561 55.2203 89.3337 63.5761 2.6279 24.5256 11.0667 15.9066 31.0653 0.7854 21.3467 19.0072 14.0814 1.6209 3.2947 0.2313
temp: 298.150 k
press: 1.00000 atm
elementType: 17 8 8 8 8 8 7 7 6 6 6 6 6 6 6 6 6 6 6 6 1 1 1 1 1 1 1 1 1 1 1 1 1 1 1
symmnumber: 1
zpe: 683905.3 jmol-1
zpe.correction: 0.260486 hartree
zpe.thermalcorrener: 0.282503 hartree
zpe.thermalcorrenthalpy: 0.283447 hartree
zpe.thermalcorrgfe: 0.206908 hartree
zpe.sumelectzpe: -1410.324491 hartree
zpe.sumelectthermal: -1410.302473 hartree
zpe.sumelectthermalent: -1410.301529 hartree
zpe.sumelectthermalfe: -1410.378069 hartree
dipole: 6.0339 1.0651 0.9798
dipole: 6.2050
quadrupole: -120.0129 -129.8704 -120.1784
quadrupole: 3.2128 2.3608 -6.4651
quadrupole: 3.3410 -6.5165 3.1755 3.2128 2.3608 -6.4651
hfenergy: -1410.5849767 hartree
pointgroup: C01 [X(C12H15Cl1N2O5)]
dipole: 2.3687356 0.1580936 0.5690136 debye
polarizability: 277.3507205|-11.9048904|180.9428127|14.4982382|17.9741349|112.5615985 unknown
InChI: InChI=1S/C12H15ClN2O5/c1-18-9-6-8(7-10(19-2)11(9)20-3)12(16)15(14-17)5-4-13/h6-7H,4-5H2,1-3H3
charge 0 multiplicity 1
35 atoms
Cl -6.791762 -0.06681 -0.539154
O  3.866544 -0.37953 0.147114
O  2.379417 -2.835273 -0.11574
O  2.401031 2.113759 0.149188
O  -2.346552 -1.451402 -1.087998
O  -3.229221 2.333526 1.245535
N  -2.722814 0.618805 -0.133668
N  -2.316201 1.519308 0.891333
C  -0.366196 -0.341535 -0.250618
C  2.463479 -0.353239 0.046425
C  1.748418 -1.585232 -0.054372
C  1.733117 0.871737 0.054712
C  0.349685 -1.566616 -0.219888
C  0.335628 0.883273 -0.100051
C  -1.827253 -0.449336 -0.518551
C  -4.108124 0.644024 -0.67323
C  -5.056174 -0.215051 0.17968
C  4.58819 0.274639 -0.978485
C  3.325129 -3.180259 0.971006
C  3.070532 2.355949 1.450858
H  -0.179433 -2.514423 -0.350515
H  -0.169453 1.84983 -0.10386
H  -4.443684 1.694731 -0.668268
H  -4.073869 0.257133 -1.702735
H  -5.129086 0.14308 1.2163
H  -4.794894 -1.280634 0.130944
H  5.654012 0.208109 -0.714336
H  4.392154 -0.278725 -1.914346
H  4.273573 1.327427 -1.080513
H  2.789699 -3.219342 1.938916
H  4.152514 -2.454218 1.020416
H  3.698908 -4.181674 0.710684
H  3.826248 1.576611 1.657473
H  2.319375 2.381124 2.262044
H  3.549862 3.341334 1.352199
