program: Gaussian 09
title: 000296502
version: EM64L-G09RevD.01
frameworkgroup: C1[X(C18H16N2O2)]
method: RPBEPBE
basis: SDD
operation: Freq
keyword: #p
keyword: freq=noraman
keyword: PBEPBE/SDD
title: #p freq=noraman PBEPBE/SDD
converged: YES YES NO NO
title: Mulliken charges:
elementType: O O N N C C C C C C C C C C C C C C C C C C H H H H H H H H H H H H H H H H
charge: -0.279431 -0.269859 -0.092950 -0.052505 0.281164 0.354494 0.380614 -0.066824 -0.289890 -0.305712 0.171982 -0.523371 -0.368826 0.320066 -0.360297 -0.306953 -0.475470 -0.374961 -0.248894 -0.222085 -0.532931 -0.536057 0.208679 0.268171 0.249961 0.228180 0.240242 0.263206 0.250291 0.243711 0.231042 0.234451 0.222571 0.222637 0.249229 0.246740 0.219645 0.219941
chargesum: 0.00000
title: Mulliken charges with hydrogens summed into heavy atoms:
elementType: O O N N C C C C C C C C C C C C C C C C C C
charge: -0.279431 -0.269859 -0.092950 -0.052505 0.281164 0.354494 0.380614 -0.066824 -0.081211 -0.037541 0.171982 -0.273410 -0.140646 0.320066 -0.120055 -0.043747 -0.225179 -0.131250 -0.017852 0.012367 0.161506 0.150269
polarizability: 4.50986427e+02 1.09073503e+01 2.65284927e+02 1.34504717e+00 -8.03100703e+00 9.82597396e+01
1716.lowfreq: -1.8116 -0.0004 -0.0002 0.0007 3.4241 7.5458 11.6638 42.2277 43.4185
frequency: 11.0405 42.2031 43.4035 72.9125 84.2272 93.8871 119.0015 141.9008 149.5043 157.2659 166.5329 210.8555 218.1947 229.8496 253.5195 271.1922 286.7377 355.0403 371.9109 380.8938 418.0603 449.7705 462.2002 468.7851 480.5105 509.3305 530.1590 550.9269 561.9471 585.8124 599.2678 636.1485 653.2098 684.7498 718.5306 735.1080 770.7163 785.1965 792.6938 796.6817 806.9085 870.5149 876.1413 878.9830 887.1810 900.4405 909.5437 925.9743 968.8270 989.2792 993.7095 1000.6597 1017.0902 1018.4576 1039.0752 1079.0197 1111.7550 1114.3120 1116.0624 1118.1461 1143.9360 1156.0648 1162.4204 1185.7168 1187.1726 1205.4166 1235.4292 1241.0699 1256.0603 1280.0112 1288.2361 1315.2790 1328.6236 1378.3511 1392.5656 1403.9695 1428.6191 1437.3785 1439.7769 1444.7338 1465.9330 1468.2583 1469.7710 1475.1965 1482.8552 1497.4034 1499.2188 1552.2266 1575.2771 1617.6525 1620.0344 1631.9329 2955.2775 2960.7918 3041.9032 3049.6506 3119.2117 3124.6858 3127.1619 3133.1533 3144.3161 3147.5259 3154.3441 3160.0991 3161.3088 3162.3341 3173.8818 3174.5784
redmass: 5.5595 5.0318 4.4896 3.5214 3.1650 3.3131 3.4232 3.7956 4.2910 4.7141 4.3663 3.9544 2.0231 1.4325 1.1793 4.6367 3.5343 5.3520 5.3623 4.6431 3.2056 4.2004 3.8409 3.6726 6.4656 6.0387 6.7233 3.8751 5.9409 4.5100 3.8074 6.2536 3.7343 5.7601 5.8144 2.9776 1.4429 5.3721 2.1568 1.8619 5.3621 2.8413 2.4624 1.6239 1.7726 1.8068 1.3590 4.7132 1.3643 8.0400 1.1867 1.3251 3.6238 2.7886 3.2674 4.3260 1.2594 1.2700 2.7574 2.1299 1.5077 1.3480 1.8972 1.3097 2.0795 1.5422 4.1585 2.2492 2.4485 1.8452 1.5418 1.6851 1.3436 3.6630 4.3152 2.7359 1.6587 2.3701 1.1707 2.5174 1.0507 1.1101 1.1857 1.0976 1.9014 2.9350 4.9851 6.5473 6.9106 5.7887 6.2780 5.4966 1.0333 1.0330 1.1039 1.1041 1.0899 1.0989 1.0994 1.0857 1.0886 1.0887 1.0868 1.0907 1.0947 1.0915 1.0998 1.0955
irintensity: 2.2448 0.3509 1.3115 6.6384 0.1711 0.2917 0.1084 5.1423 1.8463 7.7771 1.9741 0.4837 0.9105 0.4250 0.5824 2.8968 10.2521 6.2765 0.2710 0.1154 1.1273 3.4972 2.4213 6.7836 3.2496 0.1194 2.0214 5.0898 20.0279 5.8185 7.8537 5.7050 0.2452 31.2279 0.6600 1.5152 69.6647 2.5448 2.4210 66.3664 3.7501 6.7065 1.6639 0.1077 12.7440 13.7183 0.5037 6.8476 0.1999 44.3584 55.2768 1.0616 70.3961 9.4881 8.6617 6.2292 0.1591 1.3162 31.8903 26.5380 12.5461 1.0027 4.5598 13.2087 192.5207 43.2735 107.6990 18.2341 32.3329 94.7438 11.3431 23.7101 25.1884 27.4960 32.3339 71.3731 91.3385 57.4891 11.2029 17.0276 13.3848 60.2256 102.0047 4.2403 20.6947 132.5533 3.7273 67.8959 30.6309 3.3198 3.2388 129.5657 79.1644 98.9393 50.3896 46.5594 8.7071 24.7949 15.5303 1.1543 10.9486 23.1248 9.9572 4.7766 14.0233 10.4848 30.0464 14.0352
temp: 298.150 k
press: 1.00000 atm
elementType: 8 8 7 7 6 6 6 6 6 6 6 6 6 6 6 6 6 6 6 6 6 6 1 1 1 1 1 1 1 1 1 1 1 1 1 1 1 1
symmnumber: 1
zpe: 774754.1 jmol-1
zpe.correction: 0.295088 hartree
zpe.thermalcorrener: 0.314563 hartree
zpe.thermalcorrenthalpy: 0.315507 hartree
zpe.thermalcorrgfe: 0.245301 hartree
zpe.sumelectzpe: -953.847288 hartree
zpe.sumelectthermal: -953.827813 hartree
zpe.sumelectthermalent: -953.826869 hartree
zpe.sumelectthermalfe: -953.897075 hartree
dipole: 7.7832 -3.3225 1.0566
dipole: 8.5284
quadrupole: -105.6541 -117.8764 -134.3786
quadrupole: 25.3890 -2.9635 1.7965
quadrupole: 13.6489 1.4266 -15.0755 25.3890 -2.9635 1.7965
hfenergy: -954.1423763 hartree
pointgroup: C01 [X(C18H16N2O2)]
dipole: 3.1852681 0.0029427 1.0545967 debye
polarizability: 446.134041|18.3882839|123.0945045|-26.1068737|-60.7857055|245.302548 unknown
InChI: InChI=1S/C18H16N2O2/c1-21-15-9-10-18(22-2)13(11-15)7-8-14-12-19-20-17-6-4-3-5-16(14)17/h3-12H,1-2H3
charge 0 multiplicity 1
38 atoms
O  2.252065 1.736958 -2.442918
O  4.184275 -0.940867 2.119583
N  -4.75898 0.369118 -1.029064
N  -3.777595 0.596982 -1.934481
C  -3.023135 -0.074475 0.733141
C  -1.991177 0.181829 -0.250336
C  1.891215 0.484812 -0.418459
C  -4.394661 0.025848 0.279668
C  -0.565377 0.094144 0.077513
C  0.455674 0.578651 -0.703433
C  2.821863 1.094023 -1.331282
C  2.419163 -0.181031 0.715348
C  -2.78731 -0.404434 2.108049
C  3.808126 -0.247421 0.955232
C  4.210041 1.027085 -1.091259
C  -5.473975 -0.219147 1.18884
C  -2.452181 0.492237 -1.551525
C  4.711677 0.359751 0.049645
C  -3.855945 -0.638803 2.97701
C  -5.209856 -0.549659 2.517239
C  3.154191 2.365417 -3.409078
C  5.615228 -1.040782 2.41041
H  -0.315209 -0.396248 1.026068
H  0.215607 1.110015 -1.631015
H  1.757421 -0.66929 1.436632
H  -1.764311 -0.466592 2.491567
H  4.918507 1.49044 -1.783444
H  -6.491575 -0.132054 0.795593
H  -1.754269 0.660462 -2.376427
H  5.792341 0.322172 0.213785
H  -3.658757 -0.890356 4.02498
H  -6.032689 -0.737304 3.215156
H  3.834717 1.621244 -3.86673
H  3.746587 3.174154 -2.938718
H  2.496024 2.789684 -4.181194
H  5.678871 -1.614621 3.346505
H  6.069273 -0.040744 2.556058
H  6.154535 -1.579797 1.606641
