program: Gaussian 09
title: 000296441
version: EM64L-G09RevD.01
frameworkgroup: C1[X(C13H8N4OS)]
method: RPBEPBE
basis: SDD
operation: Freq
keyword: #p
keyword: freq=noraman
keyword: PBEPBE/SDD
title: #p freq=noraman PBEPBE/SDD
converged: NO NO NO NO
title: Mulliken charges:
elementType: S O N N N N C C C C C C C C C C C C C H H H H H H H H
charge: 0.326487 -0.217319 -0.373287 -0.012124 -0.136526 -0.070349 0.146869 0.169346 0.344954 0.291404 -0.243897 -0.357526 -0.365541 -0.243898 -0.223550 -0.236525 -0.231142 -0.123917 -0.501378 0.277214 0.268367 0.284918 0.231555 0.229639 0.231821 0.258377 0.276025
chargesum: 0.00000
title: Mulliken charges with hydrogens summed into heavy atoms:
elementType: S O N N N N C C C C C C C C C C C C C
charge: 0.326487 -0.217319 -0.373287 -0.012124 -0.136526 -0.070349 0.146869 0.169346 0.344954 0.291404 -0.243897 -0.080312 -0.097174 0.041020 0.008005 -0.006887 0.000680 0.134460 -0.225354
polarizability: 3.40289183e+02 1.03534732e+00 2.06531083e+02 -7.41791845e-02 9.94598308e-02 6.90034348e+01
1716.lowfreq: -0.0018 -0.0015 0.0002 3.2951 6.9926 8.6144 39.7604 45.4929 55.8276
frequency: 39.7560 45.2956 55.8258 78.2024 99.8529 123.3792 190.0639 225.8464 242.9298 281.6599 316.3184 337.9455 363.7659 404.8542 427.9019 467.5770 501.3905 561.3496 577.0546 613.8826 623.7461 641.9553 658.2302 665.8292 693.3081 703.1414 704.2712 716.2771 717.8419 768.3018 781.1414 820.0729 834.8386 850.8327 862.6120 900.3215 912.9048 928.1328 940.8698 981.0301 988.3803 990.9153 1005.4222 1028.5436 1058.8045 1083.2287 1091.3752 1108.1268 1174.6794 1180.8151 1195.8689 1207.8085 1223.9411 1291.6949 1308.2480 1331.5995 1337.9497 1383.7618 1439.5861 1445.4445 1450.9917 1468.6972 1493.7243 1529.3641 1586.6385 1609.8729 1619.7506 3129.7898 3140.9555 3153.0647 3162.6871 3171.8093 3184.2062 3200.3815 3239.2788
redmass: 6.3146 4.0667 6.6740 7.6718 6.9186 6.4442 7.1960 6.8470 5.9510 11.2220 8.8850 8.3017 7.8833 2.8549 8.5833 5.8718 3.9745 3.2055 12.1487 6.5793 11.0611 8.9439 9.8378 7.1367 6.8794 1.8039 7.9583 1.1806 11.5204 12.1565 1.8951 5.1027 13.0615 1.2889 1.2456 11.7364 8.7509 1.3815 1.4189 10.2789 6.3833 1.3777 1.3251 2.2472 1.6690 1.6575 1.2126 4.3044 1.0661 4.5834 1.2577 5.8381 1.4550 9.7427 3.8014 2.3881 1.6607 8.4774 3.2285 5.2762 2.5041 6.5199 5.9652 5.5419 6.1475 10.0920 5.9379 1.0852 1.0888 1.0932 1.0966 1.1010 1.0901 1.0982 1.1007
irintensity: 1.4260 0.1340 0.6347 0.4080 0.0125 0.3013 3.4613 0.3149 0.5042 1.2134 1.9245 3.0892 0.0149 0.0146 0.9772 3.0483 4.1760 0.9438 0.5440 0.0753 8.7494 7.0164 4.6329 31.9563 4.0414 66.4141 5.9144 106.2250 1.9202 6.8109 47.7459 11.5914 32.1785 14.3678 0.0036 71.0921 51.6280 0.8740 6.1745 25.3468 1.0536 0.0107 0.4945 5.5170 32.9555 9.0863 5.9429 9.9736 0.1909 0.2973 4.8516 13.2915 12.8618 39.6338 10.1011 0.8884 7.7818 0.2890 8.0207 49.5673 27.0149 413.3344 27.8759 13.8626 3.0222 128.3946 1.1130 0.0383 12.1611 14.0077 11.1591 23.9683 4.9175 1.4024 0.8691
temp: 298.150 k
press: 1.00000 atm
elementType: 16 8 7 7 7 7 6 6 6 6 6 6 6 6 6 6 6 6 6 1 1 1 1 1 1 1 1
symmnumber: 1
zpe: 488542.4 jmol-1
zpe.correction: 0.186076 hartree
zpe.thermalcorrener: 0.200566 hartree
zpe.thermalcorrenthalpy: 0.201510 hartree
zpe.thermalcorrgfe: 0.142760 hartree
zpe.sumelectzpe: -1191.085687 hartree
zpe.sumelectthermal: -1191.071196 hartree
zpe.sumelectthermalent: -1191.070252 hartree
zpe.sumelectthermalfe: -1191.129003 hartree
dipole: 4.6066 -4.8057 0.0035
dipole: 6.6570
quadrupole: -80.9908 -125.1032 -120.9532
quadrupole: 7.0401 0.0044 0.0043
quadrupole: 28.0249 -16.0874 -11.9375 7.0401 0.0044 0.0043
hfenergy: -1191.2717626 hartree
pointgroup: C01 [X(C13H8N4O1S1)]
dipole: 1.6979124 1.9819448 -0.2201516 debye
polarizability: 339.8986203|6.4298221|205.5495508|-4.3238824|-13.4347086|70.3755298 unknown
InChI: InChI=1S/C13H8N4OS/c1-2-5-9(6-3-1)11-14-15-13-17(11)16-12(18-13)10-7-4-8-19-10/h1-8H
charge 0 multiplicity 1
27 atoms
S  3.414712 2.151723 -0.219775
O  1.807988 -1.650692 0.182467
N  -0.213932 -0.666367 0.113851
N  0.69543 0.407964 -0.003043
N  -1.715712 -2.296982 0.289406
N  -0.412387 -2.922702 0.33487
C  -1.582406 -0.937045 0.156793
C  0.430665 -1.893101 0.224562
C  -2.672878 0.032784 0.075707
C  1.884926 -0.211079 0.04021
C  3.194648 0.365639 -0.036453
C  -4.015391 -0.434135 0.131484
C  -2.415175 1.425462 -0.056994
C  4.419843 -0.301857 0.010457
C  -5.08218 0.481538 0.055184
C  -3.492054 2.33374 -0.132548
C  -4.826087 1.868337 -0.077115
C  5.547285 0.578996 -0.096978
C  5.190157 1.914827 -0.225927
H  -4.194855 -1.50893 0.233941
H  -1.384063 1.791082 -0.099822
H  4.491224 -1.386449 0.117741
H  -6.114288 0.117147 0.09837
H  -3.289744 3.405533 -0.234745
H  -5.658667 2.577904 -0.136307
H  6.584819 0.239295 -0.080169
H  5.831922 2.788865 -0.324567
