program: Gaussian 09
title: 000296458
version: EM64L-G09RevD.01
frameworkgroup: C1[X(C11H14N4O5)]
method: RPBEPBE
basis: SDD
operation: Freq
keyword: #p
keyword: freq=noraman
keyword: PBEPBE/SDD
title: #p freq=noraman PBEPBE/SDD
converged: YES YES NO NO
title: Mulliken charges:
elementType: O O O O O N N N N C C C C C C C C C C C H H H H H H H H H H H H H H
charge: -0.251103 -0.452791 -0.446017 -0.461420 -0.226218 -0.412828 -0.003570 -0.133424 -0.058275 -0.166694 -0.169945 -0.201831 -0.091625 0.382683 -0.337595 -0.038277 -0.080356 0.143623 -0.344858 -0.501302 0.255810 0.244021 0.251480 0.239947 0.210669 0.179155 0.362958 0.352527 0.356494 0.410481 0.258997 0.246071 0.245291 0.237924
chargesum: 0.00000
title: Mulliken charges with hydrogens summed into heavy atoms:
elementType: O O O O O N N N N C C C C C C C C C C C
charge: -0.251103 -0.089833 -0.093490 -0.050939 -0.226218 -0.056334 -0.003570 -0.133424 -0.058275 0.089116 0.074076 0.049649 0.148321 0.382683 0.052228 -0.038277 -0.080356 0.143623 -0.085862 0.227983
polarizability: 2.33359079e+02 -1.91561011e+00 1.68485424e+02 -7.60439328e+00 1.73149334e+00 9.82980921e+01
1716.lowfreq: -6.0043 -4.6977 -0.0005 -0.0003 -0.0002 5.4319 34.6195 40.3929 79.9621
frequency: 34.6046 40.3525 79.9489 92.0489 119.0977 129.5867 136.8159 166.4775 166.9141 182.2044 197.9230 203.9380 221.0813 284.5338 292.1314 297.8543 311.3295 325.2868 358.7363 383.5823 408.3775 421.9686 482.2524 493.9325 509.0515 547.7578 582.8921 618.5339 627.8966 641.9518 675.6107 692.5244 701.4112 728.9353 772.8103 783.1898 798.2010 860.0357 863.4731 903.5457 906.3938 933.9810 959.3728 982.4486 993.3453 1026.8034 1030.4822 1037.7886 1054.5427 1066.6551 1086.0991 1098.0020 1111.5150 1129.5824 1172.2965 1179.7653 1197.6537 1202.3042 1209.7385 1228.0628 1239.8789 1254.1794 1291.5493 1294.0545 1297.9702 1319.8902 1334.9115 1360.8957 1367.4350 1370.2476 1378.3986 1389.8657 1403.0418 1411.1261 1448.6146 1449.8612 1454.7284 1460.7518 1476.7638 1501.5042 1534.8785 1591.3625 2924.7649 2970.0572 2983.7699 2993.1446 3006.9394 3010.1120 3038.9693 3064.6763 3115.5014 3154.4391 3174.1839 3572.0599 3577.8548 3580.1072
redmass: 6.1997 5.1199 5.3633 5.2663 4.3648 1.3290 3.9507 3.7080 3.5919 4.9974 4.2331 7.3663 5.1168 5.7160 3.7138 5.0000 1.3439 5.2882 2.6362 3.3302 1.7108 4.1348 3.7801 7.9186 6.4607 5.6016 4.3836 6.9979 10.8443 6.6947 6.1593 4.6182 6.7199 1.2065 4.0403 4.9002 8.2141 3.3645 1.4536 2.8240 6.0832 1.4281 3.3123 6.4917 3.5046 4.7332 5.0396 4.3187 3.2146 2.9388 5.0083 3.3045 1.2554 2.0499 2.5508 1.3413 2.9817 1.3990 1.1672 1.4393 2.0229 1.3324 3.5228 1.3084 1.2594 1.2671 2.2572 5.5655 1.3205 1.6932 1.6032 2.0861 1.4221 1.5521 2.1907 1.0514 1.0826 1.0672 3.3362 1.1571 5.8143 7.5276 1.0663 1.0833 1.0839 1.0753 1.0858 1.0291 1.0883 1.0904 1.1047 1.1056 1.0928 1.0660 1.0823 1.0666
irintensity: 0.2484 2.4497 1.6083 0.5254 6.6867 0.2053 8.7234 5.3201 3.3520 2.2966 1.8034 5.6956 4.3287 1.6455 20.2791 1.8223 125.4235 7.5188 15.7916 12.4146 135.8207 19.0863 13.3747 9.5134 0.5674 15.2712 1.5220 2.7751 11.1573 32.5522 10.6637 11.2129 4.1086 85.3578 9.8307 67.2590 3.6160 54.4836 109.3029 15.7750 6.9117 9.1844 20.5739 140.4402 79.1503 179.4968 19.4089 1.3848 24.0801 32.5932 15.9707 4.5797 0.0645 31.9312 3.6894 7.1474 30.0871 35.4242 10.9133 3.0726 23.5942 9.6653 100.3100 20.3326 10.5427 6.6458 19.5118 132.7614 5.0469 24.2674 24.8477 15.2352 1.0877 40.1202 1.3360 14.8139 4.9486 33.6798 164.9119 50.6015 247.1194 26.8100 137.1702 12.5469 90.3094 993.8225 58.8301 25.1456 29.0151 36.6508 21.9755 17.2480 9.9909 16.0897 114.4840 12.3160
temp: 298.150 k
press: 1.00000 atm
elementType: 8 8 8 8 8 7 7 7 7 6 6 6 6 6 6 6 6 6 6 6 1 1 1 1 1 1 1 1 1 1 1 1 1 1
symmnumber: 1
zpe: 679144.7 jmol-1
zpe.correction: 0.258673 hartree
zpe.thermalcorrener: 0.276730 hartree
zpe.thermalcorrenthalpy: 0.277674 hartree
zpe.thermalcorrgfe: 0.212656 hartree
zpe.sumelectzpe: -1021.126327 hartree
zpe.sumelectthermal: -1021.108269 hartree
zpe.sumelectthermalent: -1021.107325 hartree
zpe.sumelectthermalfe: -1021.172343 hartree
dipole: 1.7896 -2.7421 1.4411
dipole: 3.5775
quadrupole: -82.3242 -126.5734 -118.8333
quadrupole: -8.7338 1.1529 2.5082
quadrupole: 26.9194 -17.3298 -9.5897 -8.7338 1.1529 2.5082
hfenergy: -1021.3849994 hartree
pointgroup: C01 [X(C11H14N4O5)]
dipole: 0.5998226 1.1275109 -0.5916216 debye
polarizability: 232.6096064|7.8042931|169.4085189|6.1704888|1.1070166|98.1244698 unknown
InChI: InChI=1S/C11H14N4O5/c1-19-11-7-5(12-3-13-11)6(14-15-7)10-9(18)8(17)4(2-16)20-10/h3-4,8-10,14,16-18H,2H2,1H3
charge 0 multiplicity 1
34 atoms
O  2.06326 -0.249747 1.37158
O  2.751729 2.746338 -0.483545
O  4.42626 0.242276 -1.446923
O  1.716157 -2.823987 0.16763
O  -4.439547 0.270039 -0.333723
N  -0.631891 2.119278 0.358813
N  -1.982915 1.935489 0.102841
N  -0.660433 -1.469712 0.327308
N  -3.061179 -1.633889 -0.10848
C  2.502786 1.308472 -0.441873
C  1.598789 1.025724 0.785475
C  3.744965 0.437042 -0.164626
C  3.131009 -0.827576 0.491054
C  0.124688 0.968616 0.493686
C  2.537206 -1.847048 -0.511158
C  -0.803702 -0.088466 0.315104
C  -2.08076 0.563482 0.08293
C  -3.21279 -0.296385 -0.123299
C  -1.796832 -2.15581 0.109055
C  -5.580629 -0.657782 -0.538417
H  2.043889 0.962874 -1.389883
H  1.797527 1.833598 1.520091
H  4.399452 0.962611 0.561663
H  3.81041 -1.346428 1.188493
H  3.362723 -2.394804 -1.002256
H  1.972275 -1.314691 -1.30944
H  3.318628 2.944378 -1.271142
H  5.286177 -0.22592 -1.305052
H  -0.277691 3.075772 0.406102
H  0.838548 -2.357416 0.40396
H  -1.726423 -3.246823 0.09972
H  -5.708053 -1.305447 0.344315
H  -5.405761 -1.286608 -1.426679
H  -6.443077 0.008249 -0.678627
