program: Gaussian 09
title: 000296521
version: EM64L-G09RevD.01
frameworkgroup: C1[X(C21H23NO4)]
method: RPBEPBE
basis: SDD
operation: Freq
keyword: #p
keyword: freq=noraman
keyword: PBEPBE/SDD
title: #p freq=noraman PBEPBE/SDD
converged: YES YES NO NO
title: Mulliken charges:
elementType: O O O O N C C C C C C C C C C C C C C C C C C C C C H H H H H H H H H H H H H H H H H H H H H H H
charge: -0.282642 -0.288331 -0.296600 -0.299979 0.024895 -0.263612 -0.447928 -0.483488 -0.569371 0.392379 0.483816 0.331121 0.326392 -0.536749 -0.533847 -0.559640 -0.612397 0.211599 -0.554011 0.191591 0.211292 0.190262 -0.536558 -0.522185 -0.530241 -0.529948 0.235426 0.250554 0.220027 0.239553 0.218107 0.231064 0.261116 0.242639 0.256603 0.266758 0.256132 0.226471 0.224183 0.239474 0.209166 0.258174 0.225810 0.257778 0.231749 0.225151 0.251405 0.232040 0.224801
chargesum: 0.00000
title: Mulliken charges with hydrogens summed into heavy atoms:
elementType: O O O O N C C C C C C C C C C C C C C C C C C C C C
charge: -0.282642 -0.288331 -0.296600 -0.299979 0.024895 -0.028185 -0.197374 -0.023908 -0.120200 0.392379 0.483816 0.331121 0.326392 -0.275633 -0.291208 -0.303037 -0.345639 0.211599 -0.297879 0.191591 0.211292 0.190262 0.153570 0.170965 0.184437 0.178297
polarizability: 4.08767519e+02 -8.40365212e+00 2.22087268e+02 4.72396355e+00 -7.27053092e+00 1.63629287e+02
1716.lowfreq: -5.9806 0.0006 0.0009 0.0010 2.7591 4.6588 22.5916 33.5396 44.8563
frequency: 22.5046 33.5182 44.8339 51.3238 70.7623 74.9462 94.4650 108.8985 121.1031 131.0240 144.6371 155.3108 165.2929 167.9814 177.5661 189.7597 202.0379 208.5141 219.7443 249.8728 256.6348 265.1604 296.0564 314.7152 322.6296 341.1304 351.1572 396.6651 406.4604 420.6439 441.7738 452.2544 470.0480 485.4206 496.7499 519.1150 566.5158 583.8797 613.0251 622.8368 646.0975 668.3194 698.8474 702.4068 722.5735 724.7586 734.3723 753.7699 779.4308 790.4176 824.8431 855.6776 863.4796 870.6522 889.2858 900.1827 905.8145 926.6410 930.7163 947.1677 950.2777 955.0107 981.6492 1012.6079 1048.1401 1079.9080 1100.3047 1108.3280 1111.2956 1112.1626 1112.3225 1114.5895 1145.5497 1147.4520 1148.2800 1152.4076 1161.0265 1168.1800 1175.0420 1185.3743 1197.3975 1213.2693 1223.7961 1248.6870 1259.2468 1269.9043 1277.7570 1285.4347 1294.0905 1311.7574 1329.2497 1339.8231 1347.5823 1379.5258 1384.7646 1390.1634 1395.2834 1424.8304 1428.6846 1443.4445 1444.4263 1453.5471 1457.1751 1457.8379 1460.2933 1464.8842 1466.2057 1474.2732 1476.8823 1481.0432 1486.4908 1487.2294 1502.9450 1548.5043 1582.3716 1598.2968 1613.0887 1617.9297 2926.3266 2951.3581 2961.1061 2971.3635 2973.1490 2977.2018 2980.7160 2990.5193 3023.9825 3049.2603 3051.5429 3059.3373 3069.4414 3075.4504 3079.2766 3121.4478 3122.8127 3123.1821 3125.3231 3139.4081 3140.3675 3142.3873 3150.6456
redmass: 4.6866 4.0978 2.9322 2.4065 3.6813 3.2646 3.1246 2.7667 2.3575 3.1582 2.5670 1.5061 1.8624 3.0112 1.2505 3.4740 3.4717 4.5979 1.9720 4.3832 1.7576 3.3793 4.9046 3.3914 4.5129 4.8637 4.1444 4.3862 4.5682 4.4609 4.5678 6.0657 3.8414 4.1079 3.7396 4.3297 4.0068 5.7313 4.7186 6.0692 4.8374 5.2758 5.8245 5.1721 5.2135 3.5673 4.9749 3.1848 2.8397 4.1559 3.1070 1.9110 3.5709 2.1593 1.4883 1.6973 1.5704 5.3288 2.2594 2.7019 2.7401 4.1879 5.8992 2.7025 2.1718 4.7652 3.5659 2.5358 1.2426 1.2587 1.2436 1.2642 1.3501 1.5139 1.4078 1.3815 1.5003 1.6375 1.9061 1.9045 2.8750 1.4043 1.3435 1.6363 1.3974 2.3592 1.9731 1.9956 1.5389 1.7960 1.5130 2.1311 1.6972 3.0486 6.5619 2.8254 2.8377 1.1943 1.2260 1.3332 1.4030 1.0688 1.0580 1.1011 1.0669 1.0504 1.0911 1.0979 1.0556 1.0538 3.0415 1.0910 2.8712 9.2975 8.3185 8.6492 7.1008 7.0989 1.0814 1.0661 1.0325 1.0349 1.0307 1.0309 1.0798 1.0647 1.0926 1.1040 1.1038 1.0897 1.1042 1.1038 1.0967 1.0999 1.1026 1.1045 1.1032 1.0914 1.0911 1.0921 1.0903
irintensity: 0.9092 0.2864 2.4873 2.0481 0.1636 8.9879 4.2324 6.8412 3.9149 1.4496 2.2618 0.3929 1.6159 5.5856 0.3030 0.5341 5.5218 0.1452 2.5095 6.8488 0.4090 4.1135 8.6382 4.7937 6.7472 0.9756 2.3013 2.7890 8.3594 2.6844 9.1729 8.5236 8.3048 2.7852 3.0550 3.2510 11.7121 6.3029 2.8012 2.0311 2.2329 13.9862 0.8634 0.4571 0.8706 6.8400 47.2758 1.3719 4.4395 10.1864 33.3664 9.7645 15.3757 2.4121 3.4824 22.5709 4.6878 32.0464 23.3214 36.3578 52.1983 67.6275 53.1676 12.7362 7.5124 76.1182 99.5149 13.5803 12.4099 2.5767 21.3470 0.5757 1.8708 9.8731 1.4563 8.6613 12.5536 54.2232 9.2043 42.9238 29.0970 13.5695 11.0355 11.8399 31.0482 4.4107 369.9413 131.9357 0.1659 12.6016 32.7117 7.4825 28.4611 16.1665 6.7445 10.8979 5.2493 1.1869 0.6471 8.1478 5.7926 15.5810 13.5980 13.3810 7.0677 13.6465 8.0046 91.6747 7.0544 28.9198 90.4640 53.7599 154.3381 103.4083 5.1545 34.6904 36.5551 14.5031 18.3875 37.5831 59.5218 102.9324 78.2413 77.2587 11.8081 35.7439 32.8629 42.0993 35.6029 32.4754 28.6446 22.9245 42.5223 29.3812 27.8111 20.6876 22.5501 8.2139 9.9226 0.9655 4.1517
temp: 298.150 k
press: 1.00000 atm
elementType: 8 8 8 8 7 6 6 6 6 6 6 6 6 6 6 6 6 6 6 6 6 6 6 6 6 6 1 1 1 1 1 1 1 1 1 1 1 1 1 1 1 1 1 1 1 1 1 1 1
symmnumber: 1
zpe: 1035284.5 jmol-1
zpe.correction: 0.394319 hartree
zpe.thermalcorrener: 0.419156 hartree
zpe.thermalcorrenthalpy: 0.420101 hartree
zpe.thermalcorrgfe: 0.339370 hartree
zpe.sumelectzpe: -1167.707020 hartree
zpe.sumelectthermal: -1167.682183 hartree
zpe.sumelectthermalent: -1167.681238 hartree
zpe.sumelectthermalfe: -1167.761969 hartree
dipole: 3.3832 1.0601 0.1516
dipole: 3.5487
quadrupole: -134.0111 -148.2792 -146.1387
quadrupole: -13.6890 4.0217 4.1357
quadrupole: 8.7986 -5.4696 -3.3290 -13.6890 4.0217 4.1357
hfenergy: -1168.101339 hartree
pointgroup: C01 [X(C21H23N1O4)]
dipole: 1.3221763 0.4260835 0.1397525 debye
polarizability: 409.1304626|-4.6662583|222.0603197|0.8553821|5.9810981|163.2932923 unknown
InChI: InChI=1S/C21H23NO4/c1-23-17-7-12-5-6-14-15-9-19(25-3)18(24-2)8-13(15)11-22-21(14)16(12)10-20(17)26-4/h7-11,14,21H,5-6H2,1-4H3
charge 0 multiplicity 1
49 atoms
O  -5.508981 1.011038 1.005201
O  -6.050513 -1.481724 -0.280505
O  5.393656 -1.389343 0.705123
O  5.780729 1.316445 -0.362324
N  -0.368457 1.521775 -0.312363
C  0.459698 -0.88064 0.193813
C  -0.583198 0.243084 0.460642
C  0.107937 -1.644321 -1.114014
C  -1.238887 -2.373301 -0.941939
C  -2.022004 -0.228313 0.234273
C  1.873725 -0.317575 0.139679
C  -2.330698 -1.447614 -0.417926
C  2.059372 1.013363 -0.335285
C  -3.071602 0.606069 0.691344
C  0.863559 1.825239 -0.638225
C  -3.693173 -1.797353 -0.589063
C  3.00447 -1.087322 0.476253
C  -4.424206 0.2453 0.533423
C  3.366687 1.530426 -0.505756
C  -4.743335 -0.982377 -0.128926
C  4.309734 -0.559932 0.34789
C  4.494551 0.751515 -0.185795
C  -5.192828 2.251305 1.71654
C  -7.057101 -0.593413 -0.897343
C  6.274732 -0.854028 1.772087
C  6.616114 0.628469 -1.3758
H  0.392821 -1.61067 1.026076
H  -0.483631 0.549832 1.52667
H  0.909787 -2.368932 -1.349251
H  0.053558 -0.926604 -1.95556
H  -1.100525 -3.220596 -0.236744
H  -1.55878 -2.820827 -1.902088
H  -2.802977 1.555434 1.165007
H  1.014798 2.782868 -1.162186
H  -3.970086 -2.728575 -1.09605
H  2.899811 -2.106566 0.864722
H  3.526321 2.543227 -0.89317
H  -4.653443 2.965028 1.064068
H  -4.58891 2.049986 2.622587
H  -6.166828 2.673362 2.005802
H  -6.739396 -0.300637 -1.917337
H  -7.221586 0.305817 -0.281962
H  -7.973623 -1.200949 -0.952413
H  6.676481 0.136882 1.496201
H  7.086416 -1.589862 1.874484
H  5.7105 -0.779838 2.720617
H  6.750873 -0.438553 -1.121331
H  7.583267 1.153462 -1.363446
H  6.150471 0.719341 -2.375304
